{"text_format":"1","workbook":"xlsx","n_sheets":3,"sheets":["EXCEL VERSION claim-form-indivi","Data Table","School Information"],"not_rendered":{"charts":0,"images":0,"macros":0,"external_links":0,"defined_names":2,"comments":0,"pivot_tables":0},"unopened":[],"bounds":{"document_bytes":16777216,"sheet_cells":100000,"rows_first":2000,"rows_last":500,"rows_between":2000,"halvings":0,"cell_chars":16384,"cell_head_chars":4096},"cells_cut":0,"cells_raw":0,"read":"whole","date_system":"1900"}

{"sheet":"EXCEL VERSION claim-form-indivi","index":0,"n_rows":129,"n_cols":11,"rows_kept":129,"cut":false,"hidden":false,"merged":[[24,8,24,10],[24,0,24,7],[12,0,12,1],[13,0,13,1],[14,0,14,1],[15,0,15,1],[16,0,16,1],[17,0,17,1],[18,0,18,1],[19,0,19,1],[20,0,20,1],[23,5,23,7],[23,0,23,1],[12,5,12,7],[16,5,16,7],[17,5,17,7],[10,2,11,2],[10,0,11,1],[10,5,11,7],[21,0,21,1],[22,0,22,1],[18,5,18,7],[19,5,19,7],[20,5,20,7],[21,5,21,7],[22,5,22,7],[13,5,13,7],[14,5,14,7],[15,5,15,7],[7,0,7,4],[7,7,7,10],[8,7,8,10],[8,0,8,4],[8,5,8,6],[7,5,7,6]]}
["School Transport Assistance Program for Students with Disabilities - Individual Travel Assistance Personnel Payments Claim Form "]
["Copies of the following documents are required to be attached to this Claim:"]
["* Fortnightly Schedule for Casual Teacher Aide Payments Casual Claim form (where applicable)"]
["* Salary/Wage Recovery Debit Notes"]
["Please email completed claim form/s and applicable documents listed above to schooltransport.facilities@qed.qld.gov.au on a MONTHLY basis. "]
["Payments to schools will be through SAPA."]
["      "]
["School Name",null,null,null,null,"School Code",null,"Region"]
["Agnes Water State School",null,null,null,null,{"$f":"VLOOKUP(A9,'School Information'!$A$1:$C$1259,2,FALSE)","v":1983},null,{"$f":"VLOOKUP(A9,'School Information'!$A$1:$C$1259,3,FALSE)","v":"North Coast"},null,{"$f":"VLOOKUP(E9,'School Information'!$A$1:$D$1259,2,FALSE)","v":{"$error":"#N/A"}}]
[]
["Student Name (s)",null,"Transport Type\n(choose from \ndrop down list)","Claim Period",null,"Teacher Aide Name/s",null,null,"Teacher Aide Payment Details"]
[null,null,null,"From","To",null,null,null,"Employment type (choose from drop down list) ","No. of hours","Total Claimed (incl. on costs)"]
[null,null,null,null,null,null,null,null,"Casual"]
[]
[]
[]
[]
[]
[]
[]
[]
[]
[]
[null,null,null,null,null,null,null,null,"TOTAL CLAIMED"]
["Principal’s Certification - I certify the amounts claimed are to reimburse school purchased hours expended in teacher aide wages while acting in the role of Individual Travel Assistant for the student/s listed above. During the period of this claim the student/s listed were approved for an Individual Travel Assistance by the Principal Advisor Education Services or delegate through the School\nTransport Assistance Program for Students with Disabilities.",null,null,null,null,null,null,null,"Principal signature     Date      /       /"]
[]
[]
[]
[]
[]
[]
[]
[]
[]
[]
[]
[]
[]
[]
[]
[]
[]
[]
[]
[]
[]
[]
[]
[]
[]
[]
[]
[]
[]
[]
[]
[]
[]
[]
[]
[]
[]
[]
[]
[]
[]
[]
[]
[]
[]
[]
[]
[]
[]
[]
[]
[]
[]
[]
[]
[]
[]
[]
[]
[]
[]
[]
[]
[]
[]
[]
[]
[]
[]
[]
[]
[]
[]
[]
[]
[]
[]
[]
[]
[]
[]
[]
[]
[]
[]
[]
[]
[]
[]
[]
[]
[]
[]
[]
[]
[]
[]
[]
[]
[]
[]
[]
[]
["\t\t"]

{"sheet":"Data Table","index":1,"n_rows":6,"n_cols":3,"rows_kept":6,"cut":false,"hidden":false,"merged":[]}
["Transport Type",null,"Employment Type"]
["Taxi",null,"Casual"]
["Special Ed Bus",null,"Temporary"]
["Ferry ",null,"Permanent"]
["Bus"]
["Rail"]

{"sheet":"School Information","index":2,"n_rows":1259,"n_cols":4,"rows_kept":1259,"cut":false,"hidden":false,"merged":[]}
["Centre Name","Centre Code","Education Geographic Region","Column1"]
["Abercorn State School",591,"Central Queensland"]
["Abergowrie State School",1275,"North Queensland"]
["Acacia Ridge State School",25,"Metropolitan"]
["Agnes Water State School",1983,"North Coast"]
["Airville State School",598,"North Queensland"]
["Aitkenvale State School",801,"North Queensland"]
["Albany Creek State High School",2155,"Metropolitan"]
["Albany Creek State School",190,"Metropolitan"]
["Albany Hills State School",1892,"Metropolitan"]
["Albert State School",38,"North Coast"]
["Aldridge State High School",2017,"North Coast"]
["Alexandra Bay State School",1963,"Far North Queensland"]
["Alexandra Hills State High School",2175,"South East"]
["Alexandra Hills State School",405,"South East"]
["Algester State School",1866,"Metropolitan"]
["Allenstown State School",155,"Central Queensland"]
["Alligator Creek State School",773,"Central Queensland"]
["Allora P-10 State School",3,"Darling Downs South West"]
["Alloway State School",430,"North Coast"]
["Aloomba State School",870,"Far North Queensland"]
["Alpha State School",517,"Central Queensland"]
["Amamoor State School",1719,"North Coast"]
["Amberley District State School",115,"Metropolitan"]
["Ambrose State School",1415,"Central Queensland"]
["Amiens State School",1629,"Darling Downs South West"]
["Anakie State School",474,"Central Queensland"]
["Andergrove State School",1572,"Central Queensland"]
["Annandale State School",440,"North Queensland"]
["Applethorpe State School",1294,"Darling Downs South West"]
["Aramac State School",312,"Central Queensland"]
["Aratula State School",1266,"South East"]
["Arcadia Valley State School",813,"Darling Downs South West"]
["Arundel State School",1997,"South East"]
["Ascot State School",296,"Metropolitan"]
["Ashgrove State School",186,"Metropolitan"]
["Ashmore State School",1871,"South East"]
["Ashwell State School",512,"Metropolitan"]
["Aspley East State School",1004,"Metropolitan"]
["Aspley Special School",3031,"Metropolitan"]
["Aspley State High School",2076,"Metropolitan"]
["Aspley State School",610,"Metropolitan"]
["Atherton State High School",2051,"Far North Queensland"]
["Atherton State School",789,"Far North Queensland"]
["Augathella State School",357,"Darling Downs South West"]
["Augusta State School",7120,"Metropolitan"]
["Aurukun State School",274,"Far North Queensland"]
["Aviation High",2078,"Metropolitan"]
["Avoca State School",1901,"North Coast"]
["Avondale State School",572,"North Coast"]
["Ayr State High School",2008,"North Queensland"]
["Ayr State School",451,"North Queensland"]
["Babinda State School",1466,"Far North Queensland"]
["Back Plains State School",317,"Darling Downs South West"]
["Bajool State School",906,"Central Queensland"]
["Balaclava State School",1689,"Far North Queensland"]
["Bald Hills State School",4,"Metropolitan"]
["Ballandean State School",1164,"Darling Downs South West"]
["Balmoral State High School",2043,"Metropolitan"]
["Banana State School",521,"Central Queensland"]
["Banksia Beach State School",1989,"North Coast"]
["Baralaba State School",1605,"Central Queensland"]
["Barcaldine Prep-12 State School",531,"Central Queensland"]
["Bardon State School",1041,"Metropolitan"]
["Bargara State School",702,"North Coast"]
["Baringa State Primary School","A109","North Coast"]
["Baringa State Secondary College","A908","North Coast"]
["Barkly Highway State School",777,"North Queensland"]
["Barrett Adolescent Centre Special School",3056,"Metropolitan"]
["Bartle Frere State School",1730,"Far North Queensland"]
["Bauhinia State School",387,"Central Queensland"]
["Bauple State School",966,"North Coast"]
["Bay View State School",1798,"South East"]
["Beachmere State School",1961,"North Coast"]
["Beaconsfield State School",1672,"Central Queensland"]
["Beaudesert State High School",2083,"South East"]
["Beaudesert State School",158,"South East"]
["Bedourie State School",1019,"Central Queensland"]
["Beechmont State School",681,"South East"]
["Beenleigh Special School",3051,"South East"]
["Beenleigh State High School",2084,"South East"]
["Beenleigh State School",6,"South East"]
["Beerburrum State School",1598,"North Coast"]
["Beerwah State High School",2109,"North Coast"]
["Beerwah State School",569,"North Coast"]
["Begonia State School",187,"Darling Downs South West"]
["Belgian Gardens State School",509,"North Queensland"]
["Bell State School",781,"Darling Downs South West"]
["Bellbird Park State Secondary College",9322,"Metropolitan"]
["Bellenden Ker State School",1768,"Far North Queensland"]
["Bellevue Park State School",1925,"South East"]
["Bellmere State School",9319,"North Coast"]
["Belmont State School",226,"Metropolitan"]
["Benaraby State School",393,"Central Queensland"]
["Benarkin State School",1631,"Darling Downs South West"]
["Benowa State High School",2150,"South East"]
["Benowa State School",481,"South East"]
["Bentley Park College",452,"Far North Queensland"]
["Berrinba East State School",1867,"South East"]
["Berserker Street State School",1546,"Central Queensland"]
["Biboohra State School",996,"Far North Queensland"]
["Biddeston State School",1663,"Darling Downs South West"]
["Biggenden State School",666,"Central Queensland"]
["Biggera Waters State School",65,"South East"]
["Biloela State High School",2085,"Central Queensland"]
["Biloela State School",1822,"Central Queensland"]
["Binjour Plateau State School",1397,"Central Queensland"]
["Birdsville State School",1679,"Central Queensland"]
["Birkdale South State School",1915,"South East"]
["Birkdale State School",1545,"South East"]
["Blackall State School",299,"Central Queensland"]
["Blackbutt State School",739,"Darling Downs South West"]
["Blackwater North State School",1891,"Central Queensland"]
["Blackwater State High School",2134,"Central Queensland"]
["Blackwater State School",396,"Central Queensland"]
["Blair State School",1565,"Metropolitan"]
["Blenheim State School",316,"Darling Downs South West"]
["Bli Bli State School",952,"North Coast"]
["Bloomfield River State School",1173,"Far North Queensland"]
["Bloomsbury State School",981,"Central Queensland"]
["Bluewater State School",612,"North Queensland"]
["Bluff State School",344,"Central Queensland"]
["Bohlevale State School",1299,"North Queensland"]
["Bollon State School",425,"Darling Downs South West"]
["Boonah State High School",2105,"South East"]
["Boonah State School",333,"South East"]
["Boondall State School",1603,"Metropolitan"]
["Booyal Central State School",1542,"North Coast"]
["Boronia Heights State School",1981,"South East"]
["Bororen State School",899,"Central Queensland"]
["Bouldercombe State School",57,"Central Queensland"]
["Boulia State School",595,"North Queensland"]
["Bounty Boulevard State School",6134,"North Coast"]
["Bowen State High School",2065,"North Queensland"]
["Bowen State School",10,"North Queensland"]
["Bowenville State School",815,"Darling Downs South West"]
["Boyne Island State School",1191,"Central Queensland"]
["Boynewood State School",1465,"Central Queensland"]
["Bracken Ridge State High School",2118,"Metropolitan"]
["Bracken Ridge State School",772,"Metropolitan"]
["Brandon State School",466,"North Queensland"]
["Branyan Road State School",1066,"North Coast"]
["Brassall State School",571,"Metropolitan"]
["Bray Park State High School",2173,"North Coast"]
["Bray Park State School",339,"North Coast"]
["Bremer State High School",2050,"Metropolitan"]
["Bribie Island State High School",2181,"North Coast"]
["Bribie Island State School",540,"North Coast"]
["Brigalow State School",1133,"Darling Downs South West"]
["Brighton State School",1669,"Metropolitan"]
["Brightwater State School",7573,"North Coast"]
["Brisbane Bayside State College",2104,"Metropolitan"]
["Brisbane Central State School",207,"Metropolitan"]
["Brisbane School of Distance Education",3605,"Metropolitan"]
["Brisbane South State Secondary College","A792","Metropolitan"]
["Brisbane State High School",2003,"Metropolitan"]
["Brisbane Youth Education and Training Centre",2294,"Metropolitan"]
["Broadbeach State School",1381,"South East"]
["Broadwater State School",1071,"Darling Downs South West"]
["Brookfield State School",16,"Metropolitan"]
["Brookstead State School",311,"Darling Downs South West"]
["Brooweena State School",1035,"North Coast"]
["Browns Plains State High School",2164,"South East"]
["Browns Plains State School",1922,"South East"]
["Bucasia State School",1939,"Central Queensland"]
["Buddina State School",1888,"North Coast"]
["Buderim Mountain State School",223,"North Coast"]
["Builyan State School",1124,"Central Queensland"]
["Bulimba State School",17,"Metropolitan"]
["Bullyard State School",962,"North Coast"]
["Bundaberg Central State School",18,"North Coast"]
["Bundaberg East State School",497,"North Coast"]
["Bundaberg North State High School",2019,"North Coast"]
["Bundaberg North State School",161,"North Coast"]
["Bundaberg South State School",637,"North Coast"]
["Bundaberg Special School",3029,"North Coast"]
["Bundaberg State High School",2004,"North Coast"]
["Bundaberg West State School",1836,"North Coast"]
["Bundamba State School",19,"Metropolitan"]
["Bundamba State Secondary College",2130,"Metropolitan"]
["Bungunya State School",1508,"Darling Downs South West"]
["Bunker's Hill State School",853,"Darling Downs South West"]
["Buranda State School",894,"Metropolitan"]
["Burdekin School",3003,"North Queensland"]
["Burketown State School",530,"North Queensland"]
["Burleigh Heads State School",1568,"South East"]
["Burnett Heads State School",319,"North Coast"]
["Burnett State College",2089,"Central Queensland"]
["Burnside State High School",2145,"North Coast"]
["Burnside State School",1873,"North Coast"]
["Burpengary Meadows State School",5553,"North Coast"]
["Burpengary State School",601,"North Coast"]
["Burpengary State Secondary College",9676,"North Coast"]
["Burra Burri State School",1129,"Darling Downs South West"]
["Burrowes State School",1966,"South East"]
["Butchers Creek State School",1427,"Far North Queensland"]
["Bwgcolman Community School",379,"North Queensland"]
["Byfield State School",1318,"Central Queensland"]
["Bymount East State School",1047,"Darling Downs South West"]
["Caboolture East State School",1903,"North Coast"]
["Caboolture Special School",3045,"North Coast"]
["Caboolture State High School",2066,"North Coast"]
["Caboolture State School",369,"North Coast"]
["Cairns School of Distance Education",3601,"Far North Queensland"]
["Cairns State High School",2005,"Far North Queensland"]
["Cairns State Special School","A029","Far North Queensland"]
["Cairns West State School",1522,"Far North Queensland"]
["Calamvale Community College",1699,"Metropolitan"]
["Calamvale Special School",3055,"Metropolitan"]
["Calen District State College",1550,"Central Queensland"]
["Calliope State High School",9790,"Central Queensland"]
["Calliope State School",20,"Central Queensland"]
["Caloundra State High School",2116,"North Coast"]
["Caloundra State School",859,"North Coast"]
["Cambooya State School",196,"Darling Downs South West"]
["Cameron Downs State School",483,"North Queensland"]
["Camira State School",352,"Metropolitan"]
["Camooweal State School",714,"North Queensland"]
["Camp Hill State Infants and Primary School",1854,"Metropolitan"]
["Caningeraba State School",1967,"South East"]
["Cannon Hill State School",1476,"Metropolitan"]
["Cannonvale State School",589,"North Queensland"]
["Canungra State School",566,"South East"]
["Capalaba State College",5534,"South East"]
["Cape York Aboriginal Australian Academy",8009,"Far North Queensland"]
["Capella State High School",2182,"Central Queensland"]
["Capella State School",410,"Central Queensland"]
["Capricornia (Emerald Campus) School of Distance Education",3612,"Central Queensland"]
["Caravonica State School",927,"Far North Queensland"]
["Carbrook State School",278,"South East"]
["Cardwell State School",136,"Far North Queensland"]
["Carina State School",1552,"Metropolitan"]
["Carmila State School",1806,"Central Queensland"]
["Carole Park State School",1044,"Metropolitan"]
["Cavendish Road State High School",2025,"Metropolitan"]
["Cawarral State School",135,"Central Queensland"]
["Cecil Plains State School",734,"Darling Downs South West"]
["Cedar Creek State School",160,"South East"]
["Centenary Heights State High School",2121,"Darling Downs South West"]
["Centenary State High School",1668,"Metropolitan"]
["Chancellor State College",2282,"North Coast"]
["Chapel Hill State School",1872,"Metropolitan"]
["Charleville School of Distance Education",3602,"Darling Downs South West"]
["Charleville State High School",2068,"Darling Downs South West"]
["Charleville State School",185,"Darling Downs South West"]
["Charters Towers Central State School",215,"North Queensland"]
["Charters Towers School of Distance Education",3610,"North Queensland"]
["Charters Towers State High School",2006,"North Queensland"]
["Chatswood Hills State School",1924,"South East"]
["Chatsworth State School",915,"North Coast"]
["Chelona State School",677,"Central Queensland"]
["Cherbourg State School",989,"Darling Downs South West"]
["Chevallum State School",1722,"North Coast"]
["Childers State School",568,"North Coast"]
["Chillagoe State School",866,"Far North Queensland"]
["Chinchilla State High School",2087,"Darling Downs South West"]
["Chinchilla State School",244,"Darling Downs South West"]
["Churchill State School",1789,"Metropolitan"]
["Clare State School",171,"North Queensland"]
["Claremont Special School",3066,"Metropolitan"]
["Clarendon State School",1732,"Metropolitan"]
["Clarke Creek State School",606,"Central Queensland"]
["Clermont State High School",2185,"Central Queensland"]
["Clermont State School",21,"Central Queensland"]
["Cleveland District State High School",2070,"South East"]
["Cleveland Education and Training Centre",3160,"North Queensland"]
["Cleveland State School",22,"South East"]
["Clifford Park Special School",3087,"Darling Downs South West"]
["Clifton State High School",2111,"Darling Downs South West"]
["Clifton State School",687,"Darling Downs South West"]
["Clinton State School",172,"Central Queensland"]
["Cloncurry State School P-12",411,"North Queensland"]
["Clontarf Beach State High School",2091,"North Coast"]
["Clontarf Beach State School",162,"North Coast"]
["Clover Hill State School",2345,"South East"]
["Cloyna State School",1254,"Darling Downs South West"]
["Coalstoun Lakes State School",1225,"Central Queensland"]
["Collingwood Park State School",1956,"Metropolitan"]
["Collinsville State High School",2171,"North Queensland"]
["Collinsville State School",1691,"North Queensland"]
["Comet State School",173,"Central Queensland"]
["Condamine State School",24,"Darling Downs South West"]
["Coningsby State School",439,"Central Queensland"]
["Conondale State School",1352,"North Coast"]
["Cooktown State School",177,"Far North Queensland"]
["Coolabunia State School",638,"Darling Downs South West"]
["Coolangatta State School",1630,"South East"]
["Coolnwynpin State School",1927,"South East"]
["Coolum State High School",2165,"North Coast"]
["Coolum State School",1571,"North Coast"]
["Coombabah State High School",2166,"South East"]
["Coombabah State School",1909,"South East"]
["Coomera Rivers State School",7122,"South East"]
["Coomera Springs State School",5730,"South East"]
["Coomera State School",124,"South East"]
["Coomera State Special School","B016","South East"]
["Coominya State School",1359,"Metropolitan"]
["Coopers Plains State School",1247,"Metropolitan"]
["Cooran State School",602,"North Coast"]
["Cooroy State School",1165,"North Coast"]
["Coorparoo Secondary College",2077,"Metropolitan"]
["Coorparoo State School",219,"Metropolitan"]
["Coowonga State School",32,"Central Queensland"]
["Cooyar State School",1084,"Darling Downs South West"]
["Coppabella State School",1898,"Central Queensland"]
["Cordalba State School",117,"North Coast"]
["Corinda State High School",2055,"Metropolitan"]
["Corinda State School",1025,"Metropolitan"]
["Craigslea State High School",2023,"Metropolitan"]
["Craigslea State School",60,"Metropolitan"]
["Cranbrook State School",1907,"North Queensland"]
["Crawford State School",399,"Darling Downs South West"]
["Crescent Lagoon State School",762,"Central Queensland"]
["Crestmead State School",1928,"South East"]
["Crow's Nest State School",293,"Darling Downs South West"]
["Croydon State School",165,"Far North Queensland"]
["Cunnamulla P-12 State School",289,"Darling Downs South West"]
["Currajong State School",355,"North Queensland"]
["Currimundi Special School",3054,"North Coast"]
["Currimundi State School",1868,"North Coast"]
["Currumbin Community Special School",3043,"South East"]
["Currumbin State School",1168,"South East"]
["Currumbin Valley State School",775,"South East"]
["Dagun State School",892,"North Coast"]
["Daintree State School",1022,"Far North Queensland"]
["Daisy Hill State School",99,"South East"]
["Dajarra State School",1670,"North Queensland"]
["Dakabin State High School",2142,"North Coast"]
["Dakabin State School",1988,"North Coast"]
["Dalby South State School",671,"Darling Downs South West"]
["Dalby State High School",2033,"Darling Downs South West"]
["Dalby State School",28,"Darling Downs South West"]
["Dallarnil State School",950,"Central Queensland"]
["Dalveen State School",318,"Darling Downs South West"]
["Darling Heights State School",1900,"Darling Downs South West"]
["Darling Point Special School",3025,"Metropolitan"]
["Darlington State School",520,"South East"]
["Darra State School",1520,"Metropolitan"]
["Dayboro State School",191,"North Coast"]
["Deception Bay North State School",1884,"North Coast"]
["Deception Bay State High School",2107,"North Coast"]
["Deception Bay State School",237,"North Coast"]
["Deebing Heights State School",9916,"Metropolitan"]
["Delaneys Creek State School",683,"North Coast"]
["Denison State School",392,"Central Queensland"]
["Depot Hill State School",837,"Central Queensland"]
["Dimbulah State School",1226,"Far North Queensland"]
["Dingo State School",266,"Central Queensland"]
["Dirranbandi P-10 State School",1001,"Darling Downs South West"]
["Doomadgee State School",330,"North Queensland"]
["Drayton State School",31,"Darling Downs South West"]
["Drillham State School",889,"Darling Downs South West"]
["Duaringa State School",342,"Central Queensland"]
["Dulacca State School",1170,"Darling Downs South West"]
["Dundula State School",1779,"Central Queensland"]
["Dunkeld State School",934,"Darling Downs South West"]
["Dunwich State School",784,"South East"]
["Durack State School",959,"Metropolitan"]
["Durong South State School",1667,"Darling Downs South West"]
["Dutton Park State School",506,"Metropolitan"]
["Dysart State High School",2156,"Central Queensland"]
["Dysart State School",97,"Central Queensland"]
["Eagle Junction State School",726,"Metropolitan"]
["Eagleby South State School",1876,"South East"]
["Eagleby State School",1974,"South East"]
["Earnshaw State College",5180,"Metropolitan"]
["East Ayr State School",908,"North Queensland"]
["East Brisbane State School",877,"Metropolitan"]
["Eatons Hill State School",593,"Metropolitan"]
["Edens Landing State School",301,"South East"]
["Edge Hill State School",235,"Far North Queensland"]
["Eidsvold State School",581,"Central Queensland"]
["Eight Mile Plains State School",34,"Metropolitan"]
["Eimeo Road State School",545,"Central Queensland"]
["El Arish State School",1758,"Far North Queensland"]
["Elanora State High School",2183,"South East"]
["Elanora State School",1923,"South East"]
["Elimbah State School",953,"North Coast"]
["Elliott Heads State School",1347,"North Coast"]
["Emerald North State School",1904,"Central Queensland"]
["Emerald State High School",2122,"Central Queensland"]
["Emerald State School",354,"Central Queensland"]
["Emu Creek State School",154,"Darling Downs South West"]
["Emu Park State School",473,"Central Queensland"]
["Enoggera State School",35,"Metropolitan"]
["Eromanga State School",1179,"Darling Downs South West"]
["Esk State School",199,"Darling Downs South West"]
["Eton State School",310,"Central Queensland"]
["Eudlo State School",682,"North Coast"]
["Eulo State School",222,"Darling Downs South West"]
["Eumundi State School",698,"North Coast"]
["Eungella State School",1353,"Central Queensland"]
["Everleigh State School","B017","South East"]
["Everton Park State High School",2061,"Metropolitan"]
["Everton Park State School",1185,"Metropolitan"]
["Fairview Heights State School",1751,"Darling Downs South West"]
["Farleigh State School",1172,"Central Queensland"]
["Farnborough State School",1027,"Central Queensland"]
["Federal State School",1205,"North Coast"]
["Feluga State School",810,"Far North Queensland"]
{"$rows_left_out":859}