{"text_format":"1","workbook":"xlsx","n_sheets":9,"sheets":["Overview","Autism Spectrum Disorder","Hearing Impairment","Intellectual Disability","Physical Impairment","Speech-Language Impairment","Vision Impairment","Social Emotional Disorder","Working Sheet"],"not_rendered":{"charts":0,"images":7,"macros":1,"external_links":0,"defined_names":8,"comments":0,"pivot_tables":0},"unopened":[],"bounds":{"document_bytes":16777216,"sheet_cells":100000,"rows_first":2000,"rows_last":500,"rows_between":2000,"halvings":0,"cell_chars":16384,"cell_head_chars":4096},"cells_cut":0,"cells_raw":0,"read":"whole","date_system":"1900"}

{"sheet":"Overview","index":0,"n_rows":14,"n_cols":4,"rows_kept":14,"cut":false,"hidden":false,"merged":[[1,0,1,3],[2,0,2,3],[4,0,4,3],[3,0,3,3],[5,0,5,3]]}
["PART TWO - School Support Services"]
["SPECIALIST DISABILITY SUPPORT IN SCHOOLS (SDSS) PROGRAM"]
["Student and School Data for 2022"]
["Organisation Name: "]
["Instructions:\nImpairment categories are provided in the worksheets as follows: \n\nAutism Spectrum Disorder\nHearing Impairment\nIntellectual Disability\nPhysical Impairment\nSpeech-Language Impairment\nVision Impairment\nSocial Emotional Disorder\n\nPlease complete the student numbers and school details for each impairment category.\nPlease provide the number of unique eligible students for each schooling sector."]
["Program Student and School Data Summary"]
["Autism Spectrum Disorder",{"$f":"'Autism Spectrum Disorder'!A17","v":0},"Number of Unique Students  - State Schools",0]
["Hearing Impairment",{"$f":"'Hearing Impairment'!A17","v":0},"Number of Unique Students  - Catholic Schools",0]
["Intellectual Disability",{"$f":"'Intellectual Disability'!A17","v":0},"Number of Unique Students  - Independent Schools",0]
["Physical Impairment",{"$f":"'Physical Impairment'!A17","v":0},"Total",{"$f":"SUM(D7:D9)","v":0}]
["Speech-Language Impairment",{"$f":"'Speech-Language Impairment'!A17","v":0}]
["Vision Impairment",{"$f":"'Vision Impairment'!A17","v":0}]
["Social Emotional Disorder",{"$f":"'Social Emotional Disorder'!A17","v":0}]
["Total ",{"$f":"SUM(B7:B13)","v":0}]

{"sheet":"Autism Spectrum Disorder","index":1,"n_rows":17,"n_cols":5,"rows_kept":17,"cut":false,"hidden":false,"merged":[[1,0,1,4]]}
["PART TWO - School Support Services"]
["SPECIALIST DISABILITY SUPPORT IN SCHOOLS (SDSS) PROGRAM\nSCHOOL SUPPORT SERVICES\nAUTISM SPECTRUM DISORDER"]
[]
["Number of Students","Name of School Serviced","Address",null,"Education Sector"]
[null," ",{"$f":"VLOOKUP(B5,'Working Sheet'!$B:$H,5,FALSE)","v":" "},{"$f":"IF(B5=\" \",\"0\", \"1\")","v":"0"}," "]
[null," ",{"$f":"VLOOKUP(B6,'Working Sheet'!$B:$H,5,FALSE)","v":" "},{"$f":"IF(B6=\" \",\"0\", \"1\")","v":"0"}]
[" "," ",{"$f":"VLOOKUP(B7,'Working Sheet'!$B:$H,5,FALSE)","v":" "},"0"," "]
[" "," ",{"$f":"VLOOKUP(B8,'Working Sheet'!$B:$H,5,FALSE)","v":" "},"0"]
[" "," ",{"$f":"VLOOKUP(B9,'Working Sheet'!$B:$H,5,FALSE)","v":" "},"0"," "]
[null," ",{"$f":"VLOOKUP(B10,'Working Sheet'!$B:$H,5,FALSE)","v":" "},"0"]
[" "," ",{"$f":"VLOOKUP(B11,'Working Sheet'!$B:$H,5,FALSE)","v":" "},"0"]
[" "," ",{"$f":"VLOOKUP(B12,'Working Sheet'!$B:$H,5,FALSE)","v":" "},"0"]
[null," ",{"$f":"VLOOKUP(B13,'Working Sheet'!$B:$H,5,FALSE)","v":" "},"0"]
[" "," ",{"$f":"VLOOKUP(B14,'Working Sheet'!$B:$H,5,FALSE)","v":" "},{"$f":"IF(B14=\" \",\"0\", \"1\")","v":"0"}]
[null," ",{"$f":"VLOOKUP(B15,'Working Sheet'!$B:$H,5,FALSE)","v":" "},{"$f":"IF(B15=\" \",\"0\", \"1\")","v":"0"}]
[null," "]
[{"$f":"SUM(A5:A15)","v":0},null,null,{"$f":"COUNTIFS(D5:D15, \"=1\")","v":0}]

{"sheet":"Hearing Impairment","index":2,"n_rows":17,"n_cols":5,"rows_kept":17,"cut":false,"hidden":false,"merged":[[1,0,1,4]]}
["PART TWO - School Support Services"]
["SPECIALIST DISABILITY SUPPORT IN SCHOOLS (SDSS) PROGRAM\nSCHOOL SUPPORT SERVICES\nHEARING IMPAIRMENT"]
[]
["Number of Students","Name of School Serviced","Address",null,"Education Sector"]
[null," ",{"$f":"VLOOKUP(B5,'Working Sheet'!$B:$H,5,FALSE)","v":" "},{"$f":"IF(B5=\" \", \"0\", \"1\")","v":"0"}]
[null," ",{"$f":"VLOOKUP(B6,'Working Sheet'!$B:$H,5,FALSE)","v":" "},{"$f":"IF(B6=\" \", \"0\", \"1\")","v":"0"}]
[null," ",{"$f":"VLOOKUP(B7,'Working Sheet'!$B:$H,5,FALSE)","v":" "},"0"]
[null," ",{"$f":"VLOOKUP(B8,'Working Sheet'!$B:$H,5,FALSE)","v":" "},"0"]
[null," ",{"$f":"VLOOKUP(B9,'Working Sheet'!$B:$H,5,FALSE)","v":" "},"0"]
[null," ",{"$f":"VLOOKUP(B10,'Working Sheet'!$B:$H,5,FALSE)","v":" "},"0"]
[" "," ",{"$f":"VLOOKUP(B11,'Working Sheet'!$B:$H,5,FALSE)","v":" "},"0"]
[" "," ",{"$f":"VLOOKUP(B12,'Working Sheet'!$B:$H,5,FALSE)","v":" "},"0"]
[null," ",{"$f":"VLOOKUP(B13,'Working Sheet'!$B:$H,5,FALSE)","v":" "},"0"]
[" "," ",{"$f":"VLOOKUP(B14,'Working Sheet'!$B:$H,5,FALSE)","v":" "},"0"]
[" "," ",{"$f":"VLOOKUP(B15,'Working Sheet'!$B:$H,5,FALSE)","v":" "},{"$f":"IF(B15=\" \", \"0\", \"1\")","v":"0"}]
[null," "]
[{"$f":"SUM(A5:A15)","v":0},null,null,{"$f":"COUNTIF(D5:D14, \"=1\")","v":0}]

{"sheet":"Intellectual Disability","index":3,"n_rows":17,"n_cols":5,"rows_kept":17,"cut":false,"hidden":false,"merged":[[1,0,1,4]]}
["PART TWO - School Support Services"]
["SPECIALIST DISABILITY SUPPORT IN SCHOOLS (SDSS) PROGRAM\nSCHOOL SUPPORT SERVICES\nINTELLECTUAL DISABILITY"]
[]
["Number of Students","Name of School Serviced","Address",null,"Education Sector"]
[null," ",{"$f":"VLOOKUP(B5,'Working Sheet'!$B:$H,5,FALSE)","v":" "},{"$f":"IF(B5=\" \", \"0\", \"1\")","v":"0"}]
[null," ",{"$f":"VLOOKUP(B6,'Working Sheet'!$B:$H,5,FALSE)","v":" "},{"$f":"IF(B6=\" \", \"0\", \"1\")","v":"0"}]
[null," ",{"$f":"VLOOKUP(B7,'Working Sheet'!$B:$H,5,FALSE)","v":" "},"0"]
[null," ",{"$f":"VLOOKUP(B8,'Working Sheet'!$B:$H,5,FALSE)","v":" "},"0"]
[null," ",{"$f":"VLOOKUP(B9,'Working Sheet'!$B:$H,5,FALSE)","v":" "},"0"]
[null," ",null,"0"]
[" "," ",{"$f":"VLOOKUP(B11,'Working Sheet'!$B:$H,5,FALSE)","v":" "},"0"]
[" "," ",{"$f":"VLOOKUP(B12,'Working Sheet'!$B:$H,5,FALSE)","v":" "},"0"]
[" "," ",{"$f":"VLOOKUP(B13,'Working Sheet'!$B:$H,5,FALSE)","v":" "},"0"]
[" "," ",{"$f":"VLOOKUP(B14,'Working Sheet'!$B:$H,5,FALSE)","v":" "},"0"]
[null," ",{"$f":"VLOOKUP(B15,'Working Sheet'!$B:$H,5,FALSE)","v":" "}]
[" "," ",{"$f":"VLOOKUP(B16,'Working Sheet'!$B:$H,5,FALSE)","v":" "},"0"]
[{"$f":"SUM(A5:A15)","v":0},null,null,{"$f":"COUNTIF(D5:D16,\"=1\")","v":0}]

{"sheet":"Physical Impairment","index":4,"n_rows":17,"n_cols":5,"rows_kept":17,"cut":false,"hidden":false,"merged":[[1,0,1,4]]}
["PART TWO - School Support Services"]
["SPECIALIST DISABILITY SUPPORT IN SCHOOLS (SDSS) PROGRAM\nSCHOOL SUPPORT SERVICES\nPHYSICAL IMPAIRMENT"]
[]
["Number of Students","Name of School Serviced","Address",null,"Education Sector"]
[null," ",{"$f":"VLOOKUP(B5,'Working Sheet'!$B:$H,5,FALSE)","v":" "},{"$f":"IF(B5=\" \", \"0\", \"1\")","v":"0"}]
[" "," ",{"$f":"VLOOKUP(B6,'Working Sheet'!$B:$H,5,FALSE)","v":" "},"0"]
[" "," ",{"$f":"VLOOKUP(B7,'Working Sheet'!$B:$H,5,FALSE)","v":" "},"0"]
[null," ",{"$f":"VLOOKUP(B8,'Working Sheet'!$B:$H,5,FALSE)","v":" "},"0"]
[null," ",{"$f":"VLOOKUP(B9,'Working Sheet'!$B:$H,5,FALSE)","v":" "},"0"]
[null," ",{"$f":"VLOOKUP(B10,'Working Sheet'!$B:$H,5,FALSE)","v":" "},"0"]
[" "," ",{"$f":"VLOOKUP(B11,'Working Sheet'!$B:$H,5,FALSE)","v":" "},"0"]
[" "," ",{"$f":"VLOOKUP(B12,'Working Sheet'!$B:$H,5,FALSE)","v":" "},"0"]
[null," ",{"$f":"VLOOKUP(B13,'Working Sheet'!$B:$H,5,FALSE)","v":" "},"0"]
[" "," ",{"$f":"VLOOKUP(B14,'Working Sheet'!$B:$H,5,FALSE)","v":" "},"0"]
[" "," ",{"$f":"VLOOKUP(B15,'Working Sheet'!$B:$H,5,FALSE)","v":" "},"0"]
[null," ",{"$f":"VLOOKUP(B16,'Working Sheet'!$B:$H,5,FALSE)","v":" "},"0"]
[{"$f":"SUM(A5:A15)","v":0},null,null,{"$f":"COUNTIF(D5:D16,\"=1\")","v":0}]

{"sheet":"Speech-Language Impairment","index":5,"n_rows":17,"n_cols":5,"rows_kept":17,"cut":false,"hidden":false,"merged":[[1,0,1,4]]}
["PART TWO - School Support Services"]
["SPECIALIST DISABILITY SUPPORT IN SCHOOLS (SDSS) PROGRAM\nSCHOOL SUPPORT SERVICES\nSPEECH-LANGUAGE IMPAIRMENT"]
[]
["Number of Students","Name of School Serviced","Address",null,"Education Sector"]
[null," ",{"$f":"VLOOKUP(B5,'Working Sheet'!$B:$H,5,FALSE)","v":" "},{"$f":"IF(B5=\" \",\"0\", \"1\")","v":"0"}," "]
[null," ",{"$f":"VLOOKUP(B6,'Working Sheet'!$B:$H,5,FALSE)","v":" "},{"$f":"IF(B6=\" \",\"0\", \"1\")","v":"0"}," "]
[null," ",{"$f":"VLOOKUP(B7,'Working Sheet'!$B:$H,5,FALSE)","v":" "},"0"]
[null," ",{"$f":"VLOOKUP(B8,'Working Sheet'!$B:$H,5,FALSE)","v":" "},"0"]
[null," ",{"$f":"VLOOKUP(B9,'Working Sheet'!$B:$H,5,FALSE)","v":" "},"0"]
[null," ",{"$f":"VLOOKUP(B10,'Working Sheet'!$B:$H,5,FALSE)","v":" "},"0"]
[" "," ",{"$f":"VLOOKUP(B11,'Working Sheet'!$B:$H,5,FALSE)","v":" "},"0"]
[" "," ",{"$f":"VLOOKUP(B12,'Working Sheet'!$B:$H,5,FALSE)","v":" "},"0"]
[null," ",{"$f":"VLOOKUP(B13,'Working Sheet'!$B:$H,5,FALSE)","v":" "},"0"]
[" "," ",{"$f":"VLOOKUP(B14,'Working Sheet'!$B:$H,5,FALSE)","v":" "},"0"]
[" "," ",{"$f":"VLOOKUP(B15,'Working Sheet'!$B:$H,5,FALSE)","v":" "},"0"]
[" "," ",{"$f":"VLOOKUP(B16,'Working Sheet'!$B:$H,5,FALSE)","v":" "},"0"," "]
[{"$f":"SUM(A5:A15)","v":0},null,null,{"$f":"COUNTIF(D5:D16,\"=1\")","v":0}]

{"sheet":"Vision Impairment","index":6,"n_rows":17,"n_cols":5,"rows_kept":17,"cut":false,"hidden":false,"merged":[[1,0,1,4]]}
["PART TWO - School Support Services"]
["SPECIALIST DISABILITY SUPPORT IN SCHOOLS (SDSS) PROGRAM\nSCHOOL SUPPORT SERVICES\nVISION IMPAIRMENT"]
[]
["Number of Students","Name of School Serviced","Address",null,"Education Sector"]
[null," ",{"$f":"VLOOKUP(B5,'Working Sheet'!$B:$H,5,FALSE)","v":" "},{"$f":"IF(B5=\" \", \"0\", \"1\")","v":"0"}]
[null," ",{"$f":"VLOOKUP(B6,'Working Sheet'!$B:$H,5,FALSE)","v":" "},{"$f":"IF(B6=\" \", \"0\", \"1\")","v":"0"}]
[null," ",{"$f":"VLOOKUP(B7,'Working Sheet'!$B:$H,5,FALSE)","v":" "},"0"]
[null," ",{"$f":"VLOOKUP(B8,'Working Sheet'!$B:$H,5,FALSE)","v":" "},"0"]
[null," ",{"$f":"VLOOKUP(B9,'Working Sheet'!$B:$H,5,FALSE)","v":" "},"0"]
[null," ",{"$f":"VLOOKUP(B10,'Working Sheet'!$B:$H,5,FALSE)","v":" "},"0"]
[" "," ",{"$f":"VLOOKUP(B11,'Working Sheet'!$B:$H,5,FALSE)","v":" "},"0"]
[" "," ",{"$f":"VLOOKUP(B12,'Working Sheet'!$B:$H,5,FALSE)","v":" "},"0"]
[" "," ",{"$f":"VLOOKUP(B13,'Working Sheet'!$B:$H,5,FALSE)","v":" "},"0"]
[null," ",{"$f":"VLOOKUP(B14,'Working Sheet'!$B:$H,5,FALSE)","v":" "},"0"]
[" "," ",{"$f":"VLOOKUP(B15,'Working Sheet'!$B:$H,5,FALSE)","v":" "},"0"]
[null," ",{"$f":"VLOOKUP(B16,'Working Sheet'!$B:$H,5,FALSE)","v":" "},"0"]
[{"$f":"SUM(A5:A15)","v":0},null,null,{"$f":"COUNTIF(D5:D16,\"=1\")","v":0}]

{"sheet":"Social Emotional Disorder","index":7,"n_rows":18,"n_cols":5,"rows_kept":18,"cut":false,"hidden":false,"merged":[[1,0,1,4],[17,0,17,1]]}
["PART TWO - School Support Services"]
["SPECIALIST DISABILITY SUPPORT IN SCHOOLS (SDSS) PROGRAM\nSCHOOL SUPPORT SERVICES\nSOCIAL EMOTIONAL DISORDER*"]
[]
["Number of Students","Name of School Serviced","Address",null,"Education Sector"]
[null," ",{"$f":"VLOOKUP(B5,'Working Sheet'!$B:$H,5,FALSE)","v":" "},{"$f":"IF(B5=\" \", \"0\", \"1\")","v":"0"}]
[" "," ",{"$f":"VLOOKUP(B6,'Working Sheet'!$B:$H,5,FALSE)","v":" "},{"$f":"IF(B6=\" \", \"0\", \"1\")","v":"0"}]
[" ",null,null,"1"," "]
[null,null,null,"1"]
[null,null,null,"1"]
[null,null,null,"1"]
[null,null,null,"1"]
[" ",null,null,"1"]
[" ",null,null,"1"]
[]
[" ",null,null,"1"]
[null,null,null,"1"]
[{"$f":"SUM(A5:A15)","v":0},null,null,{"$f":"COUNTIF(D5:D16,\"=1\")","v":9}]
["* Students of State schools will only be considered in very limited circumstances where clear demonstration can be shown that existing State resources do not exist for the school/s identified. Please contact the SDSS Team to discuss prior to submitting an application."]

{"sheet":"Working Sheet","index":8,"n_rows":2753,"n_cols":11,"rows_kept":2753,"cut":false,"hidden":true,"merged":[]}
["Centre_Code","Centre_Name","Actual_Address_Line_1","Actual_Address_Line_2","Actual_Address_Post_Code","Merged Address","Geographical_Region_Code","Centre_Type","# of Students"]
[null," ",null,null,null," "," "," ","  "]
[null,null,null,null,null,"Address will populate automatically when school is selected"]
[null," ",null,null,null,null,null,null," "]
[5817,"A B Paterson College (Arundel)","10 A B Paterson Drive","Arundel",4214,"10 A B Paterson Drive, Arundel, 4214","SER","Non-State School",0," "," "]
[591,"Abercorn State School","957 Wuruma Dam Road","Abercorn",4627,"957 Wuruma Dam Road, Abercorn, 4627","CQR","State School",1,"State","*State"]
[1275,"Abergowrie State School","5 Venables Road","Abergowrie",4850,"5 Venables Road, Abergowrie, 4850","NQR","State School",2,"Catholic","Catholic"]
[5588,"Aboriginal & Islander Independent Community School (Acacia Ridge)","1277 Beaudesert Road","Acacia Ridge",4110,"1277 Beaudesert Road, Acacia Ridge, 4110","MER","Non-State School",3,"Independent","Independent"]
[3454,"Acacia Ridge SS - Special Education Program","c/- State School, Nyngam Street","Acacia Ridge",4110,"c/- State School, Nyngam Street, Acacia Ridge, 4110","MER","Special Education Program",4]
[25,"Acacia Ridge State School","Nyngam Street","Acacia Ridge",4110,"Nyngam Street, Acacia Ridge, 4110","MER","State School",5]
[5676,"ACE Positive Learning Centre","Edmund Street","Kippa-Ring",4021,"Edmund Street, Kippa-Ring, 4021","NCR","Positive Learning Centre",6]
[1983,"Agnes Water State School","1 Donohue Drive","Agnes Water",4677,"1 Donohue Drive, Agnes Water, 4677","NCR","State School",7]
[2423,"Agnew School (Maryborough)","19 Fazio Road","St Helens",4650,"19 Fazio Road, St Helens, 4650","NCR","Associated Facility",8]
[2424,"Agnew School (Nambour)","281 Windsor Road","Nambour",4560,"281 Windsor Road, Nambour, 4560","NCR","Associated Facility",9]
[2425,"Agnew School (Toowoomba)","40 Gerrard Street","Toowoomba",4350,"40 Gerrard Street, Toowoomba, 4350","DSR","Associated Facility",10]
[598,"Airville State School","Old Clare Road","Airville",4807,"Old Clare Road, Airville, 4807","NQR","State School",11]
[7559,"Aitkenvale SS Special Education Unit (ESL)","67-85 Wotton Street","Aitkenvale",4814,"67-85 Wotton Street, Aitkenvale, 4814","NQR","Intensive English Centre",12]
[801,"Aitkenvale State School","67-85 Wotton Street","Aitkenvale",4814,"67-85 Wotton Street, Aitkenvale, 4814","NQR","State School",13]
[5661,"Albany Creek SHS - Special Education Program","c/- Albany Creek SHS, Albany Forest Drive","Albany Creek",4035,"c/- Albany Creek SHS, Albany Forest Drive, Albany Creek, 4035","MER","Special Education Program",14]
[5804,"Albany Creek SS - Special Education Program","696 Albany Creek Road","Albany Creek",4035,"696 Albany Creek Road, Albany Creek, 4035","MER","Special Education Program",15]
[2155,"Albany Creek State High School","Albany Forest Drive","Albany Creek",4035,"Albany Forest Drive, Albany Creek, 4035","MER","State High School",16]
[190,"Albany Creek State School","696 Albany Creek Road","Albany Creek",4035,"696 Albany Creek Road, Albany Creek, 4035","MER","State School",17]
[5805,"Albany Hills SS - Special Education Program","Keong Road","Albany Creek",4035,"Keong Road, Albany Creek, 4035","MER","Special Education Program",18]
[1892,"Albany Hills State School","Keong Road","Albany Creek",4035,"Keong Road, Albany Creek, 4035","MER","State School",19]
[5636,"Albert Park Flexible Learning Centre (Milton)","1 Hale Street","Milton",4064,"1 Hale Street, Milton, 4064","MER","Non-State School",20]
[38,"Albert State School","210-220 Albert Street","Maryborough",4650,"210-220 Albert Street, Maryborough, 4650","NCR","State School",21]
[2321,"Aldridge SHS - Special Education Program","Boys Avenue","Maryborough",4650,"Boys Avenue, Maryborough, 4650","NCR","Special Education Program",22]
[2017,"Aldridge State High School","Boys Avenue","Maryborough",4650,"Boys Avenue, Maryborough, 4650","NCR","State High School",23]
[1963,"Alexandra Bay State School","Lot 1 Cape Tribulation Road","Diwan",4873,"Lot 1 Cape Tribulation Road, Diwan, 4873","FNR","State School",24]
[1642,"Alexandra Hills SHS - Special Education Program","Windemere Road","Alexandra Hills",4161,"Windemere Road, Alexandra Hills, 4161","SER","Special Education Program",25]
[5163,"Alexandra Hills SS - Special Education Program","12 Princeton Avenue","Alexandra Hills",4161,"12 Princeton Avenue, Alexandra Hills, 4161","SER","Special Education Program",26]
[2175,"Alexandra Hills State High School","Windemere Road","Alexandra Hills",4161,"Windemere Road, Alexandra Hills, 4161","SER","State High School",27]
[405,"Alexandra Hills State School","12 Princeton Avenue","Alexandra Hills",4161,"12 Princeton Avenue, Alexandra Hills, 4161","SER","State School",28]
[5806,"Algester SS - Special Education Program","19 Endiandra Street","Algester",4115,"19 Endiandra Street, Algester, 4115","MER","Special Education Program",29]
[1866,"Algester State School","19 Endiandra Street","Algester",4115,"19 Endiandra Street, Algester, 4115","MER","State School",30]
[5369,"All Hallows' School (Brisbane)","547 Ann Street","Brisbane",4000,"547 Ann Street, Brisbane, 4000","MER","Non-State School",31]
[5452,"All Saints Anglican School (Merrimac)","Highfield Drive","Merrimac",4226,"Highfield Drive, Merrimac, 4226","SER","Non-State School",32]
[5600,"All Saints Primary School (Albany Creek)","4 Faheys Road East","Albany Creek",4035,"4 Faheys Road East, Albany Creek, 4035","MER","Non-State School",33]
[5111,"All Saints' School (Boonah)","15 Oliver Street","Boonah",4310,"15 Oliver Street, Boonah, 4310","SER","Non-State School",34]
[5451,"All Souls St Gabriels School (Charters Towers)","30 Dr George Ellis Drive","Charters Towers",4820,"30 Dr George Ellis Drive, Charters Towers, 4820","NQR","Non-State School",35]
[2206,"Allenstown SS - Special Education Program","Allenstown State School, Upper Dawson Road","Allenstown",4700,"Allenstown State School, Upper Dawson Road, Allenstown, 4700","CQR","Special Education Program",36]
[155,"Allenstown State School","Upper Dawson Road","Allenstown",4700,"Upper Dawson Road, Allenstown, 4700","CQR","State School",37]
["A006","Alligator Creek SS - Special Education Program","50 Grasstree Road","Alligator Creek",4740,"50 Grasstree Road, Alligator Creek, 4740","CQR","Special Education Program",38]
[773,"Alligator Creek State School","50 Grasstree Road","Alligator Creek",4740,"50 Grasstree Road, Alligator Creek, 4740","CQR","State School",39]
[3,"Allora P-10 State School","21 Warwick Street","Allora",4362,"21 Warwick Street, Allora, 4362","DSR","State School",40]
[5807,"Allora SS - Special Education Program","21 Warwick Street","Allora",4362,"21 Warwick Street, Allora, 4362","DSR","Special Education Program",41]
[430,"Alloway State School","4334 Goodwood Road","Alloway",4670,"4334 Goodwood Road, Alloway, 4670","NCR","State School",42]
[870,"Aloomba State School","Nielsen Street","Aloomba",4871,"Nielsen Street, Aloomba, 4871","FNR","State School",43]
[517,"Alpha State School","Milton Street","Alpha",4724,"Milton Street, Alpha, 4724","CQR","State School",44]
[9628,"Alta-1 College (Caboolture)","Destiny Church, 94 Parish Road","Caboolture",4510,"Destiny Church, 94 Parish Road, Caboolture, 4510","NCR","Non-State School",45]
["A010","Alta-1 College (Distance)","Destiny Church, 94 Parish Road","Caboolture",4510,"Destiny Church, 94 Parish Road, Caboolture, 4510","NCR","Non State School Distance Education",46]
[1719,"Amamoor State School","2 Elizabeth Street","Amamoor",4570,"2 Elizabeth Street, Amamoor, 4570","NCR","State School",47]
[3553,"Amaroo Environmental Education Centre","90 Kleinton School Road","Kleinton",4352,"90 Kleinton School Road, Kleinton, 4352","DSR","Outdoor and Environmental Education Centre",48]
[6590,"Amberley District SS - Special Education Program","37 Deebing Creek Road","Yamanto",4305,"37 Deebing Creek Road, Yamanto, 4305","MER","Special Education Program",49]
[115,"Amberley District State School","37 Deebing Creek Road","Yamanto",4305,"37 Deebing Creek Road, Yamanto, 4305","MER","State School",50]
[1415,"Ambrose State School","39 Gentle Annie Road","Ambrose",4695,"39 Gentle Annie Road, Ambrose, 4695","CQR","State School",51]
[5077,"Ambrose Treacy College (Indooroopilly)","Twigg Street","Indooroopilly",4068,"Twigg Street, Indooroopilly, 4068","MER","Non-State School",52]
[1629,"Amiens State School","1337 Amiens Road","Amiens",4380,"1337 Amiens Road, Amiens, 4380","DSR","State School",53]
[474,"Anakie State School","Cook Street","The Gemfields",4702,"Cook Street, The Gemfields, 4702","CQR","State School",54]
[9933,"Andergrove SS - Special Education Program","Fernleigh Avenue","Andergrove",4740,"Fernleigh Avenue, Andergrove, 4740","CQR","Special Education Program",55]
[1572,"Andergrove State School","Fernleigh Avenue","Andergrove",4740,"Fernleigh Avenue, Andergrove, 4740","CQR","State School",56]
["A086","Angelorum College (Distance)","377 St Pauls Terrace","Fortitude Valley",4006,"377 St Pauls Terrace, Fortitude Valley, 4006","MER","Non State School Distance Education",57]
["A057","Angelorum College (Fortitude Valley)","377 St Pauls Terrace","Fortitude Valley",4006,"377 St Pauls Terrace, Fortitude Valley, 4006","MER","Non-State School",58]
[5446,"Anglican Church Grammar School (East Brisbane)","Oaklands Parade","East Brisbane",4169,"Oaklands Parade, East Brisbane, 4169","MER","Non-State School",59]
[5573,"Annandale Christian College (Annandale)","104-156 Yolanda Drive","Annandale",4814,"104-156 Yolanda Drive, Annandale, 4814","NQR","Non-State School",60]
[5809,"Annandale SS - Special Education Program","Cnr Oleander Street & Yolanda Drive","Annandale",4814,"Cnr Oleander Street & Yolanda Drive, Annandale, 4814","NQR","Special Education Program",61]
[440,"Annandale State School","Cnr Oleander Street & Yolanda Drive","Annandale",4814,"Cnr Oleander Street & Yolanda Drive, Annandale, 4814","NQR","State School",62]
[1294,"Applethorpe State School","25576 New England Highway","Applethorpe",4378,"25576 New England Highway, Applethorpe, 4378","DSR","State School",63]
[5316,"Aquinas College (Ashmore)","Edmund Rice Drive","Ashmore",4214,"Edmund Rice Drive, Ashmore, 4214","SER","Non-State School",64]
[312,"Aramac State School","69 Porter Street","Aramac",4726,"69 Porter Street, Aramac, 4726","CQR","State School",65]
[1266,"Aratula State School","41 Elizabeth Street","Aratula",4309,"41 Elizabeth Street, Aratula, 4309","SER","State School",66]
[9087,"Arcadia College (Varsity Lakes)","1 Bellvue Drive","Varsity Lakes",4227,"1 Bellvue Drive, Varsity Lakes, 4227","SER","Non-State School",67]
[813,"Arcadia Valley State School","4831 Arcadia Valley Road","Arcadia Valley",4454,"4831 Arcadia Valley Road, Arcadia Valley, 4454","DSR","State School",68]
["A740","Arethusa College (Deception Bay)","1-83 Deception Bay Road","Deception Bay",4508,"1-83 Deception Bay Road, Deception Bay, 4508","NCR","Non-State School",69]
["A741","Arethusa College (Spring Hill)","25 Quarry Street","Spring Hill",4004,"25 Quarry Street, Spring Hill, 4004","MER","Associated Facility",70]
["A742","Arethusa College (Windsor)","356 Lutwyche Road","Windsor",4030,"356 Lutwyche Road, Windsor, 4030","MER","Associated Facility",71]
[6604,"Arundel Early Intervention Centre","9a Byth Street","Arundel",4214,"9a Byth Street, Arundel, 4214","SER","Support Unit (Other)",72]
[3288,"Arundel SS - Special Education Program","Cnr Napper Road & Arundel Drive","Arundel",4214,"Cnr Napper Road & Arundel Drive, Arundel, 4214","SER","Special Education Program",73]
[1997,"Arundel State School","Cnr Napper Road & Arundel Drive","Arundel",4214,"Cnr Napper Road & Arundel Drive, Arundel, 4214","SER","State School",74]
[9988,"Ascot SS - Special Education Program","Pringle Street","Ascot",4007,"Pringle Street, Ascot, 4007","MER","Special Education Program",75]
{"$rows_left_out":2673}