{"text_format":"1","workbook":"xlsx","n_sheets":3,"sheets":["Schools & Students","Distribution of Labour","ValidationLists"],"not_rendered":{"charts":0,"images":1,"macros":1,"external_links":0,"defined_names":3,"comments":0,"pivot_tables":0},"unopened":[],"bounds":{"document_bytes":16777216,"sheet_cells":100000,"rows_first":2000,"rows_last":500,"rows_between":2000,"halvings":0,"cell_chars":16384,"cell_head_chars":4096},"cells_cut":0,"cells_raw":0,"read":"whole","date_system":"1900"}

{"sheet":"Schools & Students","index":0,"n_rows":504,"n_cols":18,"rows_kept":504,"cut":false,"hidden":false,"merged":[[2,1,2,17],[1,1,1,17],[0,0,0,17]]}
["Specialist Disability Support in Schools Program - Performance Measures\nSpecialised Equipment "]
["Organisation Name:"]
["Funding Year:"]
["SPECIALISED EQUIPMENT","UNIT COST\n(excl GST)","# OF ITEMS","TOTAL COST\n(excl GST)","NAME OF SCHOOL ACCESSING SERVICE\n(Please double click on each cell to enable the autocomplete function)","SCHOOL CODE","REGION","CENTRE TYPE","NUMBER OF UNIQUE STUDENTS USING THE ITEM","AUTISM SPECTRUM DISORDER","HEARING IMPAIRMENT","INTELLECTUAL DISABILITY","PHYSICAL IMPAIRMENT","SPEECH-LANGUAGE IMPAIRMENT","VISION IMPAIRMENT","SOCIAL EMOTIONAL DISORDER (SED)                      \nEligibility:         \n•\tNon-state schools - Students with a verification under the Education Adjustment Program for SED    \n•\tState schools - Students must be recorded as receiving substantial or extensive adjustments to address SED in the Nationally Consistent Collection of Data (NCCD) ","OTHER DISABILITY \n(please enter the type of disability below)","NUMBER OF STUDENTS RELEVANT TO THE 'OTHER DISABILITY' ENTERED IN ADJACENT COLUMN"]
["Item Name","$","#","Auto Calculation",null,{"$f":"VLOOKUP(E5,ValidationLists!$1:$1048576,2,)","v":{"$error":"#N/A"}},{"$f":"VLOOKUP(E5,ValidationLists!$1:$1048576,4,)","v":{"$error":"#N/A"}},{"$f":"VLOOKUP(E5,ValidationLists!$1:$1048576,3,)","v":{"$error":"#N/A"}}]
[null,null,null,{"$f":"SUM(B6*C6)","v":0},null,{"$f":"VLOOKUP(E6,ValidationLists!$1:$1048576,2,)","v":{"$error":"#N/A"}},{"$f":"VLOOKUP(E6,ValidationLists!$1:$1048576,4,)","v":{"$error":"#N/A"}},{"$f":"VLOOKUP(E6,ValidationLists!$1:$1048576,3,)","v":{"$error":"#N/A"}}]
[null,null,null,{"$f":"SUM(B7*C7)","v":0},null,{"$f":"VLOOKUP(E7,ValidationLists!$1:$1048576,2,)","v":{"$error":"#N/A"}},{"$f":"VLOOKUP(E7,ValidationLists!$1:$1048576,4,)","v":{"$error":"#N/A"}},{"$f":"VLOOKUP(E7,ValidationLists!$1:$1048576,3,)","v":{"$error":"#N/A"}}]
[null,null,null,{"$f":"SUM(B8*C8)","v":0},null,{"$f":"VLOOKUP(E8,ValidationLists!$1:$1048576,2,)","v":{"$error":"#N/A"}},{"$f":"VLOOKUP(E8,ValidationLists!$1:$1048576,4,)","v":{"$error":"#N/A"}},{"$f":"VLOOKUP(E8,ValidationLists!$1:$1048576,3,)","v":{"$error":"#N/A"}}]
[null,null,null,0,null,{"$f":"VLOOKUP(E9,ValidationLists!$1:$1048576,2,)","v":{"$error":"#N/A"}},{"$f":"VLOOKUP(E9,ValidationLists!$1:$1048576,4,)","v":{"$error":"#N/A"}},{"$f":"VLOOKUP(E9,ValidationLists!$1:$1048576,3,)","v":{"$error":"#N/A"}}]
[null,null,null,0,null,{"$f":"VLOOKUP(E10,ValidationLists!$1:$1048576,2,)","v":{"$error":"#N/A"}},{"$f":"VLOOKUP(E10,ValidationLists!$1:$1048576,4,)","v":{"$error":"#N/A"}},{"$f":"VLOOKUP(E10,ValidationLists!$1:$1048576,3,)","v":{"$error":"#N/A"}}]
[null,null,null,0,null,{"$f":"VLOOKUP(E11,ValidationLists!$1:$1048576,2,)","v":{"$error":"#N/A"}},{"$f":"VLOOKUP(E11,ValidationLists!$1:$1048576,4,)","v":{"$error":"#N/A"}},{"$f":"VLOOKUP(E11,ValidationLists!$1:$1048576,3,)","v":{"$error":"#N/A"}}]
[null,null,null,0,null,{"$f":"VLOOKUP(E12,ValidationLists!$1:$1048576,2,)","v":{"$error":"#N/A"}},{"$f":"VLOOKUP(E12,ValidationLists!$1:$1048576,4,)","v":{"$error":"#N/A"}},{"$f":"VLOOKUP(E12,ValidationLists!$1:$1048576,3,)","v":{"$error":"#N/A"}}]
[null,null,null,0,null,{"$f":"VLOOKUP(E13,ValidationLists!$1:$1048576,2,)","v":{"$error":"#N/A"}},{"$f":"VLOOKUP(E13,ValidationLists!$1:$1048576,4,)","v":{"$error":"#N/A"}},{"$f":"VLOOKUP(E13,ValidationLists!$1:$1048576,3,)","v":{"$error":"#N/A"}}]
[null,null,null,0,null,{"$f":"VLOOKUP(E14,ValidationLists!$1:$1048576,2,)","v":{"$error":"#N/A"}},{"$f":"VLOOKUP(E14,ValidationLists!$1:$1048576,4,)","v":{"$error":"#N/A"}},{"$f":"VLOOKUP(E14,ValidationLists!$1:$1048576,3,)","v":{"$error":"#N/A"}}]
[null,null,null,0,null,{"$f":"VLOOKUP(E15,ValidationLists!$1:$1048576,2,)","v":{"$error":"#N/A"}},{"$f":"VLOOKUP(E15,ValidationLists!$1:$1048576,4,)","v":{"$error":"#N/A"}},{"$f":"VLOOKUP(E15,ValidationLists!$1:$1048576,3,)","v":{"$error":"#N/A"}}]
[null,null,null,0,null,{"$f":"VLOOKUP(E16,ValidationLists!$1:$1048576,2,)","v":{"$error":"#N/A"}},{"$f":"VLOOKUP(E16,ValidationLists!$1:$1048576,4,)","v":{"$error":"#N/A"}},{"$f":"VLOOKUP(E16,ValidationLists!$1:$1048576,3,)","v":{"$error":"#N/A"}}]
[null,null,null,0,null,{"$f":"VLOOKUP(E17,ValidationLists!$1:$1048576,2,)","v":{"$error":"#N/A"}},{"$f":"VLOOKUP(E17,ValidationLists!$1:$1048576,4,)","v":{"$error":"#N/A"}},{"$f":"VLOOKUP(E17,ValidationLists!$1:$1048576,3,)","v":{"$error":"#N/A"}}]
[null,null,null,0,null,{"$f":"VLOOKUP(E18,ValidationLists!$1:$1048576,2,)","v":{"$error":"#N/A"}},{"$f":"VLOOKUP(E18,ValidationLists!$1:$1048576,4,)","v":{"$error":"#N/A"}},{"$f":"VLOOKUP(E18,ValidationLists!$1:$1048576,3,)","v":{"$error":"#N/A"}}]
[null,null,null,0,null,{"$f":"VLOOKUP(E19,ValidationLists!$1:$1048576,2,)","v":{"$error":"#N/A"}},{"$f":"VLOOKUP(E19,ValidationLists!$1:$1048576,4,)","v":{"$error":"#N/A"}},{"$f":"VLOOKUP(E19,ValidationLists!$1:$1048576,3,)","v":{"$error":"#N/A"}}]
[null,null,null,0,null,{"$f":"VLOOKUP(E20,ValidationLists!$1:$1048576,2,)","v":{"$error":"#N/A"}},{"$f":"VLOOKUP(E20,ValidationLists!$1:$1048576,4,)","v":{"$error":"#N/A"}},{"$f":"VLOOKUP(E20,ValidationLists!$1:$1048576,3,)","v":{"$error":"#N/A"}}]
[null,null,null,0,null,{"$f":"VLOOKUP(E21,ValidationLists!$1:$1048576,2,)","v":{"$error":"#N/A"}},{"$f":"VLOOKUP(E21,ValidationLists!$1:$1048576,4,)","v":{"$error":"#N/A"}},{"$f":"VLOOKUP(E21,ValidationLists!$1:$1048576,3,)","v":{"$error":"#N/A"}}]
[null,null,null,0,null,{"$f":"VLOOKUP(E22,ValidationLists!$1:$1048576,2,)","v":{"$error":"#N/A"}},{"$f":"VLOOKUP(E22,ValidationLists!$1:$1048576,4,)","v":{"$error":"#N/A"}},{"$f":"VLOOKUP(E22,ValidationLists!$1:$1048576,3,)","v":{"$error":"#N/A"}}]
[null,null,null,0,null,{"$f":"VLOOKUP(E23,ValidationLists!$1:$1048576,2,)","v":{"$error":"#N/A"}},{"$f":"VLOOKUP(E23,ValidationLists!$1:$1048576,4,)","v":{"$error":"#N/A"}},{"$f":"VLOOKUP(E23,ValidationLists!$1:$1048576,3,)","v":{"$error":"#N/A"}}]
[null,null,null,0,null,{"$f":"VLOOKUP(E24,ValidationLists!$1:$1048576,2,)","v":{"$error":"#N/A"}},{"$f":"VLOOKUP(E24,ValidationLists!$1:$1048576,4,)","v":{"$error":"#N/A"}},{"$f":"VLOOKUP(E24,ValidationLists!$1:$1048576,3,)","v":{"$error":"#N/A"}}]
[null,null,null,0,null,{"$f":"VLOOKUP(E25,ValidationLists!$1:$1048576,2,)","v":{"$error":"#N/A"}},{"$f":"VLOOKUP(E25,ValidationLists!$1:$1048576,4,)","v":{"$error":"#N/A"}},{"$f":"VLOOKUP(E25,ValidationLists!$1:$1048576,3,)","v":{"$error":"#N/A"}}]
[null,null,null,0,null,{"$f":"VLOOKUP(E26,ValidationLists!$1:$1048576,2,)","v":{"$error":"#N/A"}},{"$f":"VLOOKUP(E26,ValidationLists!$1:$1048576,4,)","v":{"$error":"#N/A"}},{"$f":"VLOOKUP(E26,ValidationLists!$1:$1048576,3,)","v":{"$error":"#N/A"}}]
[null,null,null,0,null,{"$f":"VLOOKUP(E27,ValidationLists!$1:$1048576,2,)","v":{"$error":"#N/A"}},{"$f":"VLOOKUP(E27,ValidationLists!$1:$1048576,4,)","v":{"$error":"#N/A"}},{"$f":"VLOOKUP(E27,ValidationLists!$1:$1048576,3,)","v":{"$error":"#N/A"}}]
[null,null,null,0,null,{"$f":"VLOOKUP(E28,ValidationLists!$1:$1048576,2,)","v":{"$error":"#N/A"}},{"$f":"VLOOKUP(E28,ValidationLists!$1:$1048576,4,)","v":{"$error":"#N/A"}},{"$f":"VLOOKUP(E28,ValidationLists!$1:$1048576,3,)","v":{"$error":"#N/A"}}]
[null,null,null,0,null,{"$f":"VLOOKUP(E29,ValidationLists!$1:$1048576,2,)","v":{"$error":"#N/A"}},{"$f":"VLOOKUP(E29,ValidationLists!$1:$1048576,4,)","v":{"$error":"#N/A"}},{"$f":"VLOOKUP(E29,ValidationLists!$1:$1048576,3,)","v":{"$error":"#N/A"}}]
[null,null,null,0,null,{"$f":"VLOOKUP(E30,ValidationLists!$1:$1048576,2,)","v":{"$error":"#N/A"}},{"$f":"VLOOKUP(E30,ValidationLists!$1:$1048576,4,)","v":{"$error":"#N/A"}},{"$f":"VLOOKUP(E30,ValidationLists!$1:$1048576,3,)","v":{"$error":"#N/A"}}]
[null,null,null,0,null,{"$f":"VLOOKUP(E31,ValidationLists!$1:$1048576,2,)","v":{"$error":"#N/A"}},{"$f":"VLOOKUP(E31,ValidationLists!$1:$1048576,4,)","v":{"$error":"#N/A"}},{"$f":"VLOOKUP(E31,ValidationLists!$1:$1048576,3,)","v":{"$error":"#N/A"}}]
[null,null,null,0,null,{"$f":"VLOOKUP(E32,ValidationLists!$1:$1048576,2,)","v":{"$error":"#N/A"}},{"$f":"VLOOKUP(E32,ValidationLists!$1:$1048576,4,)","v":{"$error":"#N/A"}},{"$f":"VLOOKUP(E32,ValidationLists!$1:$1048576,3,)","v":{"$error":"#N/A"}}]
[null,null,null,0,null,{"$f":"VLOOKUP(E33,ValidationLists!$1:$1048576,2,)","v":{"$error":"#N/A"}},{"$f":"VLOOKUP(E33,ValidationLists!$1:$1048576,4,)","v":{"$error":"#N/A"}},{"$f":"VLOOKUP(E33,ValidationLists!$1:$1048576,3,)","v":{"$error":"#N/A"}}]
[null,null,null,0,null,{"$f":"VLOOKUP(E34,ValidationLists!$1:$1048576,2,)","v":{"$error":"#N/A"}},{"$f":"VLOOKUP(E34,ValidationLists!$1:$1048576,4,)","v":{"$error":"#N/A"}},{"$f":"VLOOKUP(E34,ValidationLists!$1:$1048576,3,)","v":{"$error":"#N/A"}}]
[null,null,null,0,null,{"$f":"VLOOKUP(E35,ValidationLists!$1:$1048576,2,)","v":{"$error":"#N/A"}},{"$f":"VLOOKUP(E35,ValidationLists!$1:$1048576,4,)","v":{"$error":"#N/A"}},{"$f":"VLOOKUP(E35,ValidationLists!$1:$1048576,3,)","v":{"$error":"#N/A"}}]
[null,null,null,0,null,{"$f":"VLOOKUP(E36,ValidationLists!$1:$1048576,2,)","v":{"$error":"#N/A"}},{"$f":"VLOOKUP(E36,ValidationLists!$1:$1048576,4,)","v":{"$error":"#N/A"}},{"$f":"VLOOKUP(E36,ValidationLists!$1:$1048576,3,)","v":{"$error":"#N/A"}}]
[null,null,null,0,null,{"$f":"VLOOKUP(E37,ValidationLists!$1:$1048576,2,)","v":{"$error":"#N/A"}},{"$f":"VLOOKUP(E37,ValidationLists!$1:$1048576,4,)","v":{"$error":"#N/A"}},{"$f":"VLOOKUP(E37,ValidationLists!$1:$1048576,3,)","v":{"$error":"#N/A"}}]
[null,null,null,0,null,{"$f":"VLOOKUP(E38,ValidationLists!$1:$1048576,2,)","v":{"$error":"#N/A"}},{"$f":"VLOOKUP(E38,ValidationLists!$1:$1048576,4,)","v":{"$error":"#N/A"}},{"$f":"VLOOKUP(E38,ValidationLists!$1:$1048576,3,)","v":{"$error":"#N/A"}}]
[null,null,null,0,null,{"$f":"VLOOKUP(E39,ValidationLists!$1:$1048576,2,)","v":{"$error":"#N/A"}},{"$f":"VLOOKUP(E39,ValidationLists!$1:$1048576,4,)","v":{"$error":"#N/A"}},{"$f":"VLOOKUP(E39,ValidationLists!$1:$1048576,3,)","v":{"$error":"#N/A"}}]
[null,null,null,0,null,{"$f":"VLOOKUP(E40,ValidationLists!$1:$1048576,2,)","v":{"$error":"#N/A"}},{"$f":"VLOOKUP(E40,ValidationLists!$1:$1048576,4,)","v":{"$error":"#N/A"}},{"$f":"VLOOKUP(E40,ValidationLists!$1:$1048576,3,)","v":{"$error":"#N/A"}}]
[null,null,null,0,null,{"$f":"VLOOKUP(E41,ValidationLists!$1:$1048576,2,)","v":{"$error":"#N/A"}},{"$f":"VLOOKUP(E41,ValidationLists!$1:$1048576,4,)","v":{"$error":"#N/A"}},{"$f":"VLOOKUP(E41,ValidationLists!$1:$1048576,3,)","v":{"$error":"#N/A"}}]
[null,null,null,0,null,{"$f":"VLOOKUP(E42,ValidationLists!$1:$1048576,2,)","v":{"$error":"#N/A"}},{"$f":"VLOOKUP(E42,ValidationLists!$1:$1048576,4,)","v":{"$error":"#N/A"}},{"$f":"VLOOKUP(E42,ValidationLists!$1:$1048576,3,)","v":{"$error":"#N/A"}}]
[null,null,null,0,null,{"$f":"VLOOKUP(E43,ValidationLists!$1:$1048576,2,)","v":{"$error":"#N/A"}},{"$f":"VLOOKUP(E43,ValidationLists!$1:$1048576,4,)","v":{"$error":"#N/A"}},{"$f":"VLOOKUP(E43,ValidationLists!$1:$1048576,3,)","v":{"$error":"#N/A"}}]
[null,null,null,0,null,{"$f":"VLOOKUP(E44,ValidationLists!$1:$1048576,2,)","v":{"$error":"#N/A"}},{"$f":"VLOOKUP(E44,ValidationLists!$1:$1048576,4,)","v":{"$error":"#N/A"}},{"$f":"VLOOKUP(E44,ValidationLists!$1:$1048576,3,)","v":{"$error":"#N/A"}}]
[null,null,null,0,null,{"$f":"VLOOKUP(E45,ValidationLists!$1:$1048576,2,)","v":{"$error":"#N/A"}},{"$f":"VLOOKUP(E45,ValidationLists!$1:$1048576,4,)","v":{"$error":"#N/A"}},{"$f":"VLOOKUP(E45,ValidationLists!$1:$1048576,3,)","v":{"$error":"#N/A"}}]
[null,null,null,0,null,{"$f":"VLOOKUP(E46,ValidationLists!$1:$1048576,2,)","v":{"$error":"#N/A"}},{"$f":"VLOOKUP(E46,ValidationLists!$1:$1048576,4,)","v":{"$error":"#N/A"}},{"$f":"VLOOKUP(E46,ValidationLists!$1:$1048576,3,)","v":{"$error":"#N/A"}}]
[null,null,null,0,null,{"$f":"VLOOKUP(E47,ValidationLists!$1:$1048576,2,)","v":{"$error":"#N/A"}},{"$f":"VLOOKUP(E47,ValidationLists!$1:$1048576,4,)","v":{"$error":"#N/A"}},{"$f":"VLOOKUP(E47,ValidationLists!$1:$1048576,3,)","v":{"$error":"#N/A"}}]
[null,null,null,0,null,{"$f":"VLOOKUP(E48,ValidationLists!$1:$1048576,2,)","v":{"$error":"#N/A"}},{"$f":"VLOOKUP(E48,ValidationLists!$1:$1048576,4,)","v":{"$error":"#N/A"}},{"$f":"VLOOKUP(E48,ValidationLists!$1:$1048576,3,)","v":{"$error":"#N/A"}}]
[null,null,null,0,null,{"$f":"VLOOKUP(E49,ValidationLists!$1:$1048576,2,)","v":{"$error":"#N/A"}},{"$f":"VLOOKUP(E49,ValidationLists!$1:$1048576,4,)","v":{"$error":"#N/A"}},{"$f":"VLOOKUP(E49,ValidationLists!$1:$1048576,3,)","v":{"$error":"#N/A"}}]
[null,null,null,0,null,{"$f":"VLOOKUP(E50,ValidationLists!$1:$1048576,2,)","v":{"$error":"#N/A"}},{"$f":"VLOOKUP(E50,ValidationLists!$1:$1048576,4,)","v":{"$error":"#N/A"}},{"$f":"VLOOKUP(E50,ValidationLists!$1:$1048576,3,)","v":{"$error":"#N/A"}}]
[null,null,null,0,null,{"$f":"VLOOKUP(E51,ValidationLists!$1:$1048576,2,)","v":{"$error":"#N/A"}},{"$f":"VLOOKUP(E51,ValidationLists!$1:$1048576,4,)","v":{"$error":"#N/A"}},{"$f":"VLOOKUP(E51,ValidationLists!$1:$1048576,3,)","v":{"$error":"#N/A"}}]
[null,null,null,0,null,{"$f":"VLOOKUP(E52,ValidationLists!$1:$1048576,2,)","v":{"$error":"#N/A"}},{"$f":"VLOOKUP(E52,ValidationLists!$1:$1048576,4,)","v":{"$error":"#N/A"}},{"$f":"VLOOKUP(E52,ValidationLists!$1:$1048576,3,)","v":{"$error":"#N/A"}}]
[null,null,null,0,null,{"$f":"VLOOKUP(E53,ValidationLists!$1:$1048576,2,)","v":{"$error":"#N/A"}},{"$f":"VLOOKUP(E53,ValidationLists!$1:$1048576,4,)","v":{"$error":"#N/A"}},{"$f":"VLOOKUP(E53,ValidationLists!$1:$1048576,3,)","v":{"$error":"#N/A"}}]
[null,null,null,0,null,{"$f":"VLOOKUP(E54,ValidationLists!$1:$1048576,2,)","v":{"$error":"#N/A"}},{"$f":"VLOOKUP(E54,ValidationLists!$1:$1048576,4,)","v":{"$error":"#N/A"}},{"$f":"VLOOKUP(E54,ValidationLists!$1:$1048576,3,)","v":{"$error":"#N/A"}}]
[null,null,null,0,null,{"$f":"VLOOKUP(E55,ValidationLists!$1:$1048576,2,)","v":{"$error":"#N/A"}},{"$f":"VLOOKUP(E55,ValidationLists!$1:$1048576,4,)","v":{"$error":"#N/A"}},{"$f":"VLOOKUP(E55,ValidationLists!$1:$1048576,3,)","v":{"$error":"#N/A"}}]
[null,null,null,0,null,{"$f":"VLOOKUP(E56,ValidationLists!$1:$1048576,2,)","v":{"$error":"#N/A"}},{"$f":"VLOOKUP(E56,ValidationLists!$1:$1048576,4,)","v":{"$error":"#N/A"}},{"$f":"VLOOKUP(E56,ValidationLists!$1:$1048576,3,)","v":{"$error":"#N/A"}}]
[null,null,null,0,null,{"$f":"VLOOKUP(E57,ValidationLists!$1:$1048576,2,)","v":{"$error":"#N/A"}},{"$f":"VLOOKUP(E57,ValidationLists!$1:$1048576,4,)","v":{"$error":"#N/A"}},{"$f":"VLOOKUP(E57,ValidationLists!$1:$1048576,3,)","v":{"$error":"#N/A"}}]
[null,null,null,0,null,{"$f":"VLOOKUP(E58,ValidationLists!$1:$1048576,2,)","v":{"$error":"#N/A"}},{"$f":"VLOOKUP(E58,ValidationLists!$1:$1048576,4,)","v":{"$error":"#N/A"}},{"$f":"VLOOKUP(E58,ValidationLists!$1:$1048576,3,)","v":{"$error":"#N/A"}}]
[null,null,null,0,null,{"$f":"VLOOKUP(E59,ValidationLists!$1:$1048576,2,)","v":{"$error":"#N/A"}},{"$f":"VLOOKUP(E59,ValidationLists!$1:$1048576,4,)","v":{"$error":"#N/A"}},{"$f":"VLOOKUP(E59,ValidationLists!$1:$1048576,3,)","v":{"$error":"#N/A"}}]
[null,null,null,0,null,{"$f":"VLOOKUP(E60,ValidationLists!$1:$1048576,2,)","v":{"$error":"#N/A"}},{"$f":"VLOOKUP(E60,ValidationLists!$1:$1048576,4,)","v":{"$error":"#N/A"}},{"$f":"VLOOKUP(E60,ValidationLists!$1:$1048576,3,)","v":{"$error":"#N/A"}}]
{"$rows_left_out":445}
{"sheet":"Distribution of Labour","index":1,"n_rows":32,"n_cols":9,"rows_kept":32,"cut":false,"hidden":false,"merged":[[0,0,0,8]]}
["Specialist Disability Support in Schools Program - Performance Measures\nSpecialised Equipment "]
["#","Position title\n(As per Attachment 1 of your Service Agreement)","Discipline","Total SDSS hours per annum excluding leave","Professional Support\n(Time spent on SDSS supports)\n%","SDSS Travel\n%","Administration of SDSS program\n%","Other work activities related to SDSS supports\n%","Total time allocation (calculation of Columns E to H must equal 100% in column I)"]
[1,null,null,null,null,null,null,null,{"$f":"SUM(E3:H3)","v":0}]
[2,null,null,null,null,null,null,null,{"$f":"SUM(E4:H4)","v":0}]
[3,null,null,null,null,null,null,null,0]
[4,null,null,null,null,null,null,null,0]
[5,null,null,null,null,null,null,null,0]
[6,null,null,null,null,null,null,null,0]
[7,null,null,null,null,null,null,null,0]
[8,null,null,null,null,null,null,null,0]
[9,null,null,null,null,null,null,null,0]
[10,null,null,null,null,null,null,null,0]
[11,null,null,null,null,null,null,null,0]
[12,null,null,null,null,null,null,null,0]
[13,null,null,null,null,null,null,null,0]
[14,null,null,null,null,null,null,null,0]
[15,null,null,null,null,null,null,null,0]
[16,null,null,null,null,null,null,null,0]
[17,null,null,null,null,null,null,null,0]
[18,null,null,null,null,null,null,null,0]
[19,null,null,null,null,null,null,null,0]
[20,null,null,null,null,null,null,null,0]
[21,null,null,null,null,null,null,null,0]
[22,null,null,null,null,null,null,null,0]
[23,null,null,null,null,null,null,null,0]
[24,null,null,null,null,null,null,null,0]
[25,null,null,null,null,null,null,null,0]
[26,null,null,null,null,null,null,null,0]
[27,null,null,null,null,null,null,null,0]
[28,null,null,null,null,null,null,null,0]
[29,null,null,null,null,null,null,null,0]
[30,null,null,null,null,null,null,null,0]

{"sheet":"ValidationLists","index":2,"n_rows":2052,"n_cols":12,"rows_kept":2052,"cut":false,"hidden":true,"merged":[]}
["Centre_Name","Centre_Code","Centre_Type","Geographical_Region_Code",null,"# of Services provided","Funding Category","No of Visits by Profession","No of eligible students","No of students using this item","Professional Type"]
[]
["Select School from the list",null,null,null,"Number of Unique Students","Autism Spectrum Disorder","Hearing Impairment","Intellectual Impairment","Physical Impairment","Speech-Launguage Impairment","Vision Impairment","Social Emotional Disorder*"]
[]
["A B Paterson College (Arundel)",5817,"Non-State School","SER","Select No of students from the list","Select No of students from the list","Select No of students from the list","Select No of students from the list","Select No of students from the list","Select No of students from the list","Select No of students from the list","Select No of students from the list"]
["Abercorn State School","0591","State School","CQR"]
["Abergowrie State School",1275,"State School","NQR",0,0,0,0,0,0,0,0]
["Aboriginal & Islander Independent Community School (Acacia Ridge)",5588,"Non-State School","MER",1,1,1,1,1,1,1,1]
["Acacia Ridge State School","0025","State School","MER",2,2,2,2,2,2,2,2]
["ACE Positive Learning Centre",5676,"Positive Learning Centre","NCR",3,3,3,3,3,3,3,3]
["Agnes Water State School",1983,"State School","NCR",4,4,4,4,4,4,4,4]
["Airville State School","0598","State School","NQR",5,5,5,5,5,5,5,5]
["Aitkenvale State School","0801","State School","NQR",6,6,6,6,6,6,6,6]
["Albany Creek State High School",2155,"State High School","MER",7,7,7,7,7,7,7,7]
["Albany Creek State School","0190","State School","MER",8,8,8,8,8,8,8,8]
["Albany Hills State School",1892,"State School","MER",9,9,9,9,9,9,9,9]
["Albert Park Flexible Learning Centre (Milton)",5636,"Non-State School","MER",10,10,10,10,10,10,10,10]
["Albert State School","0038","State School","NCR",11,11,11,11,11,11,11,11]
["Aldridge State High School",2017,"State High School","NCR",12,12,12,12,12,12,12,12]
["Alexandra Bay State School",1963,"State School","FNR",13,13,13,13,13,13,13,13]
["Alexandra Hills State High School",2175,"State High School","SER",14,14,14,14,14,14,14,14]
["Alexandra Hills State School","0405","State School","SER",15,15,15,15,15,15,15,15]
["Alexandra Hills TAFE Senior Studies Program","B058","Centre for Continuing Secondary Education","SER",16,16,16,16,16,16,16,16]
["Algester State School",1866,"State School","MER",17,17,17,17,17,17,17,17]
["All Hallows' School (Brisbane)",5369,"Non-State School","MER",18,18,18,18,18,18,18,18]
["All Saints Anglican School (Merrimac)",5452,"Non-State School","SER",19,19,19,19,19,19,19,19]
["All Saints Primary School (Albany Creek)",5600,"Non-State School","MER",20,20,20,20,20,20,20,20]
["All Saints' School (Boonah)",5111,"Non-State School","SER",21,21,21,21,21,21,21,21]
["All Souls St Gabriels School (Charters Towers)",5451,"Non-State School","NQR",22,22,22,22,22,22,22,22]
["Allenstown State School","0155","State School","CQR",23,23,23,23,23,23,23,23]
["Alligator Creek State School","0773","State School","CQR",24,24,24,24,24,24,24,24]
["Allora P-10 State School","0003","State School","DSR",25,25,25,25,25,25,25,25]
["Alloway State School","0430","State School","NCR",26,26,26,26,26,26,26,26]
["Aloomba State School","0870","State School","FNR",27,27,27,27,27,27,27,27]
["Alpha State School","0517","State School","CQR",28,28,28,28,28,28,28,28]
["Alta-1 College (King St - Caboolture)","A915","Associated Facility","NCR",29,29,29,29,29,29,29,29]
["Alta-1 College (Parish Rd - Caboolture)",9628,"Non-State School","NCR",30,30,30,30,30,30,30,30]
["Amamoor State School",1719,"State School","NCR",31,31,31,31,31,31,31,31]
["Amaroo Environmental Education Centre",3553,"Outdoor and Environmental Education Centre","DSR",32,32,32,32,32,32,32,32]
["Amberley District State School","0115","State School","MER",33,33,33,33,33,33,33,33]
["Ambrose State School",1415,"State School","CQR",34,34,34,34,34,34,34,34]
["Ambrose Treacy College (Indooroopilly)",5077,"Non-State School","MER",35,35,35,35,35,35,35,35]
["Amiens State School",1629,"State School","DSR",36,36,36,36,36,36,36,36]
["Anakie State School","0474","State School","CQR",37,37,37,37,37,37,37,37]
["Andergrove State School",1572,"State School","CQR",38,38,38,38,38,38,38,38]
["Angelorum College (Distance)","A086","Non State School Distance Education","MER",39,39,39,39,39,39,39,39]
["Angelorum College (Fortitude Valley)","A057","Non-State School","MER",40,40,40,40,40,40,40,40]
["Anglican Church Grammar School (East Brisbane)",5446,"Non-State School","MER",41,41,41,41,41,41,41,41]
["Annandale Christian College (Annandale)",5573,"Non-State School","NQR",42,42,42,42,42,42,42,42]
["Annandale State School","0440","State School","NQR",43,43,43,43,43,43,43,43]
["Applethorpe State School",1294,"State School","DSR",44,44,44,44,44,44,44,44]
["Aquinas College (Ashmore)",5316,"Non-State School","SER",45,45,45,45,45,45,45,45]
["Aramac State School","0312","State School","CQR",46,46,46,46,46,46,46,46]
["Aratula State School",1266,"State School","SER",47,47,47,47,47,47,47,47]
["Arcadia College (Robina)","A624","Non-State School","SER",48,48,48,48,48,48,48,48]
["Arcadia Valley State School","0813","State School","DSR",49,49,49,49,49,49,49,49]
["Arethusa College (Deception Bay)","A740","Non-State School","NCR",50,50,50,50,50,50,50,50]
["Arethusa College (Spring Hill)","A741","Associated Facility","MER",51,51,51,51,51,51,51,51]
["Arethusa College (Windsor)","A742","Associated Facility","MER",52,52,52,52,52,52,52,52]
["Arundel Early Intervention Centre",6604,"Support Unit (Other)","SER",53,53,53,53,53,53,53,53]
{"$rows_left_out":1992}