{"text_format":"1","workbook":"xlsx","n_sheets":21,"sheets":["Instructions","Cover Page","1. Consult","2. Capability","3. Risk","4. Specific Risk","5. Plant Mgt","6. Emergency Mgt","7. Employee Wellbeing","8. Contractor","9. Injury & Claims Mgt","10. Incident Mgt","11. Review","12. Leadership","Results","Action Plan","Access Import","Working","Lists","Centre List","Workplace_Lookup"],"not_rendered":{"charts":1,"images":9,"macros":1,"external_links":1,"defined_names":513,"comments":1,"pivot_tables":0},"unopened":[],"bounds":{"document_bytes":16777216,"sheet_cells":100000,"rows_first":2000,"rows_last":500,"rows_between":2000,"halvings":0,"cell_chars":16384,"cell_head_chars":4096},"cells_cut":0,"cells_raw":0,"read":"whole","date_system":"1900"}

{"sheet":"Instructions","index":0,"n_rows":31,"n_cols":24,"rows_kept":31,"cut":false,"hidden":false,"merged":[]}
[null," Annual Safety Assessment (ASA) - Four key steps to completion"]
[]
[]
[]
[]
[]
[]
[]
[]
[]
[]
[null,null,null,null,null,null,null,null,null,null,null,null,null,null,null,null,null,null,null,null,null,null,null,"Click to Start"]
[]
[]
[]
[]
[]
[]
[]
[]
[]
[]
[]
[]
[]
[]
[]
[]
[]
[]
[null,"Instructions:"]

{"sheet":"Cover Page","index":1,"n_rows":39,"n_cols":17,"rows_kept":39,"cut":false,"hidden":false,"merged":[[7,9,7,11],[7,12,7,15],[9,12,9,15],[34,1,34,5],[34,6,34,9],[36,1,36,5],[36,6,36,9],[20,6,20,9],[9,4,9,8],[11,4,11,8],[22,6,22,9],[24,6,24,9],[26,1,26,5],[24,1,24,5],[9,9,9,11],[11,1,11,3],[38,1,38,5],[38,6,38,9],[7,3,7,8],[32,1,32,5],[32,6,32,9],[30,1,30,5],[30,6,30,9],[26,6,26,9],[28,6,28,9],[22,1,22,5],[20,1,20,5],[18,1,18,5],[16,1,16,5],[28,1,28,5],[16,6,16,9],[18,6,18,9]]}
[]
[]
[]
[]
[]
[null,"2024 Annual Safety Assessment",null,null,null,null,null,null,null,null,null,null,null,null,null,{"$f":"Results!F22","v":"v.2024.03"}]
[]
[null,"Workplace Name:  ",null,null,null,null,null,null,null,"Region:  "]
[]
[null,"Assessment Compiled By:",null,null,null,null,null,null,null,"Date Assessment Finalised: "]
[]
[null,"Name of Officer in Charge \n(e.g. Principal's Name):",null,null,null,null,null,null,null,null,"Result: Overall Percentage",null,null,{"$f":"Overall_Result","v":"N/A"}]
[]
[]
[null,"Section Status "]
[]
[null,"1. Communication and Consultation",null,null,null,null,{"$f":"'1. Consult'!C6","v":"Not Started - 0 of 9 Questions Answered"}]
[]
[null,"2. HSW Capability",null,null,null,null,{"$f":"'2. Capability'!C6","v":"Not Started - 0 of 6 Questions Answered"}]
[]
[null,"3. Risk Management",null,null,null,null,{"$f":"'3. Risk'!C6","v":"Not Started - 0 of 10 Questions Answered"}]
[]
[null,"4. Specific Risk",null,null,null,null,{"$f":"'4. Specific Risk'!C6","v":"Not Started - 0 of 34 Questions Answered"}]
[]
[null,"5. Plant Management",null,null,null,null,{"$f":"'5. Plant Mgt'!C6","v":"Not Started - 0 of 8 Questions Answered"}]
[]
[null,"6. Emergency Management",null,null,null,null,{"$f":"'6. Emergency Mgt'!C6","v":"Not Started - 0 of 15 Questions Answered"}]
[]
[null,"7. Employee Wellbeing",null,null,null,null,{"$f":"'7. Employee Wellbeing'!C6","v":"Not Started - 0 of 6 Questions Answered"}]
[]
[null,"8. Contractor and Supplier Management",null,null,null,null,{"$f":"'8. Contractor'!C6","v":"Not Started - 0 of 8 Questions Answered"}]
[]
[null,"9. Employee Injury and Claims Management",null,null,null,null,{"$f":"'9. Injury & Claims Mgt'!C6","v":"Not Started - 0 of 6 Questions Answered"}]
[]
[null,"10. Incident Management",null,null,null,null,{"$f":"'10. Incident Mgt'!C6","v":"Not Started - 0 of 13 Questions Answered"}]
[]
[null,"11. Review and Improvement",null,null,null,null,{"$f":"'11. Review'!$C$6","v":"Not Started - 0 of 5 Questions Answered"},null,null,null,null,null,null,null,null,null,"Note all questions must be answered and principal must review before submitting"]
[]
[null,"12. Leadership and Governance",null,null,null,null,{"$f":"'12. Leadership'!C6","v":"Not Started - 0 of 13 Questions Answered"}]

{"sheet":"1. Consult","index":2,"n_rows":21,"n_cols":16,"rows_kept":21,"cut":false,"hidden":false,"merged":[[9,1,9,15],[14,1,14,15],[5,2,5,5],[13,8,13,13],[11,8,11,13],[7,1,7,7],[13,2,13,7],[12,2,12,7],[11,2,11,7],[10,2,10,7],[10,8,10,13],[12,8,12,13],[4,7,5,15],[20,2,20,7],[15,8,15,13],[16,8,16,13],[18,8,18,13],[19,8,19,13],[20,8,20,13],[15,2,15,7],[16,2,16,7],[18,2,18,7],[19,2,19,7],[17,1,17,15]]}
[]
[]
[]
[]
[null,"1. Communication and Consultation",null,null,null,null,null,"This element describes the mechanisms and processes to ensure the effective communication of HSW information, facilitation of consultation and engagement on HSW matters. Consultation pathways should be clearly defined. Consultation should occur during risk management processes, investigating HSW incidents, when planning changes to work policies and practices that affect safety; and when determining HSW training needs. Consultation may occur through an established committee, ASA and HSRs, staff meetings, and newsletters. Meaningful consultation will not only advise everyone concerned about HSW issues, but also seek a broad range of views and input before decisions are made."]
[null,"Status:",{"$f":"IF(AND(A_1.1=\"\",A_1.2=\"\",A_1.3=\"\",A_1.4=\"\",A_1.5=\"\",A_1.6=\"\",A_1.7=\"\",A_1.8=\"\",A_1.9=\"\"),\"Not Started - 0 of 9 Questions Answered\", IF(AND(A_1.1<>\"\",A_1.2<>\"\",A_1.3<>\"\",A_1.4<>\"\",A_1.5<>\"\",A_1.6<>\"\",A_1.7<>\"\",A_1.8<>\"\",A_1.9<>\"\"),\"Complete: 9 of 9 Questions Answered\",\"In Progress - \"& COUNTA(O11:O14,O16,O17,O19,O20,O21)& \" of 9 Questions Answered\"))","v":"Not Started - 0 of 9 Questions Answered"}]
[]
[null,"QUESTIONS",null,null,null,null,null,null,"GUIDELINES",null,null,null,null,null,"Y/N","YOUR NOTES"]
[]
[null,"WORKPLACE HEALTH & SAFETY COMMITTEE.  For more information visit: https://education.qld.gov.au/initiatives-and-strategies/health-and-wellbeing/workplaces/safety/managing/committees"]
[null,"1.1\nUpdated","Are the details of your Health, Safety and Wellbeing (HSW) committee or consultation forum updated each year in the MyHR WHS Committees module to ensure details remain current?",null,null,null,null,null,"Don’t create a new committee each year.  Update your committee details using the instructions in the factsheet. You must be a member of the committee to update the details:\nUpdate your Committee in MyHR WHS \n\nSmaller workplaces (e.g. with less than 30 employees) may establish a HSW committee as part of another meeting or forum (e.g. a staff meeting), however, it will still require registration as a committee within MyHR WHS. \n\n\nEnsure the committee has diverse representation of the occupation groups in your school."]
[null,"1.2\nUpdated","Is the HSW committee or forum chaired by the Principal / Manager / Director / Regional Director?",null,null,null,null,null,"Procedure: Health, safety and wellbeing committees  \n\nGuideline: Conducting a school/workplace HSW Committee Meeting\n\nEnsuring a decision maker is the chair of the committee assists with ownership at management level and allocation of actions;\n\ni.e.  School HSW Committees chaired by the Principal\n        Regional HSW Committees chaired by the Regional Director\n\nManaging health and safety - committees and consultation"]
[null,"1.3\nUpdated","Are meetings held at least once a term (using the agenda template as a guide to ensure all topics are covered) and recorded in MyHR WHS Committee Meeting Mgmt (Meeting) module, and finalised (closed) before the end of each term?",null,null,null,null,null,"The latest HSW Committee or forum meeting minutes are uploaded in the MyHR WHS Committee Meeting Mgmt (Meeting) module and are up-to-date. Refer to MyHR WHS Reference Guides.\n\nManaging health and safety - committees and consultation\n\nEnsure there is evidence of WHS matters discussed in small school HSW forums to show compliance with legal duty to consult."]
[null,"1.4\nUpdated","Has a current terms of reference (ToR) been developed at the beginning of the school year (Term 1) AND discussed and endorsed at the first HSW Committee AND the endorsed TOR uploaded in the MyHR WHS Committee Meeting Mgmt (Committee) module (not the (Meeting) module)?",null,null,null,null,null,"ToR is to be updated every twelve months; AND is uploaded to the MyHR WHS Committee Meeting Mgmt (Committee) module. Refer to MyHR WHS Reference Guides.\nAll aspects of the question must be \"Yes\" to submit a \"Yes\" response.\n\nTerms of Reference (ToR) template"]
[null,"HEALTH & SAFETY REPRESENTATIVES.  For more information visit: https://education.qld.gov.au/initiatives-and-strategies/health-and-wellbeing/workplaces/safety/managing/hsr"]
[null,"1.5 \nUpdated","Have all employees at the location been told of their right to elect a Health and Safety Representative (HSR)?\n\nNB: Work groups may chose not to elect a HSR. \n       Do not confuse (elected ) HSR and (appointed) Health and Safety Advisors (HSA)\n       roles.",null,null,null,null,null,"1. A HSR has been elected; or \n2. A call for nominations has been conducted within the last 12 months and no nominations were forthcoming.\nThis should be documented in appropriate forum (e.g. staff meeting minutes) as per the HSR requirements.\n\nDo not confuse HSR with Health and Safety Advisors (HSA). HSR is elected and must complete 5 day training course, HSA is nominated. HSA cannot be the HSR"]
[null,"1.6\nUpdated\n","If elected and trained has the name of the elected Health & Safety Representative been recorded in the MyHR WHS Location page and displayed on relevant noticeboards?",null,null,null,null,null,"The name of the HSR should be recorded in the MyHR Location Details screen AND displayed at the workplace. Refer to MyHR WHS Reference Guides. (See 'Set up your location page’) \n\nOnly elected and trained HSRs are to be recorded in the HSR field.  Leave this field blank if there is no elected HSR.\n\n* Has the HSR undertaken approved HSR training, with evidence of training maintained on file?"]
[null,"HEALTH & SAFETY COMMUNICATION "]
[null,1.7,"Has the school/workplace established a documented way to communicate HSW matters? e.g. a noticeboard (physical or electronic)",null,null,null,null,null,"To ensure all employees and contract staff are aware of where and how health, safety and wellbeing information is communicated. \nThere is a documented process as to how staff are made aware e.g. induction. handbooks, staff meetings, noticeboards, emails.\nThere is evidence of the communication channel e.g. some may have a physical noticeboard in a central location, or noticeboards in various parts of the location e.g. staffrooms.\nOther locations may have this information on a shared electronic noticeboard or webpage.\n\nThe Information is current and includes:\n - the Department’s HSW Commitment Statement\n - names and contact details of health and safety advisors (HSA), HSR/s if required, RRTWC, first aid officers\n - members of the emergency control organisation (e.g. chief warden, floor/area warden, etc.), HSW committee members\n - information on how to access first aid and emergency contact details\n - information about accessing Employee Assistance Service \n - information for what to do if you are injured at work, including how to report an incident  \n - HSW committee meeting schedule and latest minutes\n - Policies and Procedures specific to the workplace\n - Emergency preparedness (e.g. fire safety)\n - Other HSW information relevant to the workplace - for example emergent HSW issues.\n -  current safety alerts and/or information as required"]
[null,"1.8\nUpdated","Is an agreed HSW Issue Resolution process prominently displayed in the workplace?",null,null,null,null,null,"HSW Issue Resolution process (i.e. HSW Issue Resolution Flowchart) has been consulted and endorsed at the HSW committee meeting, with a current copy displayed on the HSW Notice Board, has been consulted and agreed upon (documented).\n\nIf you amend the generic issue resolution process discuss and have the changes endorsed at your HSW Committee. "]
[null,1.9,"The school/workplace has established a documented and approved process for consultation on HSW matters specific to the workplace?",null,null,null,null,null,"There is a local documented process that demonstrates agreed consultation processes at the workplace e.g.\n- the local HSW issue resolution process\n- election of HSRs and deputy HSRs\n- HSW committee meetings\n- how consultation is conducted for emergent or changed hazards, new activities or other issues"]

{"sheet":"2. Capability","index":3,"n_rows":15,"n_cols":16,"rows_kept":15,"cut":false,"hidden":false,"merged":[[10,2,10,7],[10,8,10,13],[11,2,11,7],[11,8,11,13],[14,2,14,7],[14,8,14,13],[12,2,12,7],[12,8,12,13],[13,2,13,7],[13,8,13,13],[9,2,9,7],[9,8,9,13],[5,2,5,5],[7,1,7,7],[4,7,5,15]]}
[]
[]
[]
[]
[null,"2. HSW Capability",null,null,null,null,null,"This element describes the knowledge, skill and competency requirements to enable safe conduct of work. \u0096 All staff should receive regular training in workplace emergency procedures (such as, evacuations and lockdowns), and key H&S procedures (such as, incident reporting and risk management). \u0096 HSW topics should be included in induction programs for all staff. \u0096 More specific HSW training should be provided to staff based on their role. \u0096 Records of the training undertaken should be maintained.\nAll staff should receive HSW induction training, and HSW training relevant to their work role and duties (refer to HSW procedures for information)."]
[null,"Status:",{"$f":"IF(AND(A_2.1=\"\",A_2.2=\"\",A_2.3=\"\",A_2.4=\"\",A_2.5=\"\",A_2.6=\"\"),\"Not Started - 0 of 6 Questions Answered\", IF(AND(A_2.1<>\"\",A_2.2<>\"\",A_2.3<>\"\",A_2.4<>\"\",A_2.5<>\"\",A_2.6<>\"\"),\"Complete: 6 of 6 Questions Answered\",\"In Progress - \"& COUNTA(O10:O15)& \" of 6 Questions Answered\"))","v":"Not Started - 0 of 6 Questions Answered"}]
[]
[null,"QUESTIONS",null,null,null,null,null,null,"GUIDELINES",null,null,null,null,null,"Y/N","YOUR NOTES"]
[]
[null,2.1,"Is local (site based) HSW Induction provided for all newly appointed staff and staff returning from extended absence (e.g. 12 months), with evidence available to support date of induction and content of induction?",null,null,null,null,null,"All employees have completed a HSW induction. Health, Safety and Wellbeing induction fact sheet.\n\nKeep a record of local employee inductions.  OneInduction templates can be used to record site based/local inductions.\n \nRole specific induction is to be undertaken e.g.  task and machinery induction for schools officers, manual tasks information for teacher aides working with special needs, chemical information for cleaners.\n\nEnsure MAST completion certificate sighted for contract (tracer) teachers\n\nMandatory Training Ready Reckoner\n\nOneInduction\n\nInduction Planner"]
[null,2.2000000000000002,"Has Mandatory Training been undertaken by all staff (as per the Ready Reckoner) and evidence maintained?",null,null,null,null,null,"All employees have completed the HSW Mandatory Training within the last twelve months.  For information visit the Mandatory All-Staff Training program webpage\n"]
[null,"2.3 \nUpdated\n","Have HSW training needs been identified in consultation with employees and scheduled into professional development plans for the year?",null,null,null,null,null,"HSW training has been identified and scheduled into a Training Planner/Register or equivalent professional development (PD) register."]
[null,2.4,"Have the training needs of all HSW roles [i.e. Health Safety Advisor (HSA), Rehabilitation and RTW Coordinator (RRTWC), Health and Safety Representatives (HSR) and First Aid Officer] been identified, scheduled and completed with evidence on training maintained?",null,null,null,null,null,"HSA, RRTWC, HSR and First Aid Officers have been trained to perform their roles.  Record the dates of training (completed and scheduled) and the course details locally to ensure information can be tracked and retrieved.  \nRehabilitation and Return to Work Coordinator Training on QLearn\n"]
[null,2.5,"The details of HSA, HSR and RRTWC are up to date and kept current in the MyHR WHS Administration Location Page.",null,null,null,null,null,"Ensure a system is in place (e.g. Use of the HSW Planning Calendar) at the beginning of each term that ensures that HSW roles in myHR WHS are current and up to date.\nHSA, HSR, RRTWC names are current and up-to-date in MyHR WHS Administration / Location Page - workplaces / schools to consider a succession plan for periods of absences from these key roles and update MyHR WHS accordingly. Refer to MyHR WHS Reference Guides.  Note that the election of HSRs is at the discretion of local work groups and therefore not every workplace will have a HSR.\nMyHR WHS set up your location"]
[null,"2.6\nUpdated","Have identified staff completed the Asbestos management training and records of training are maintained? Identified staff include the \"Officer in Charge\" (OIC) and their nominated delegates as per the Mandatory Annual Training - Ready Reckoner: 2024 Edition.",null,null,null,null,null,"At ACM sites the Officer in Charge must establish at least one delegate if:\n-  the facility is a state school \n-  the facility has appointed a full time Business Manager\n\nIn order to be considered to be nominated as an OIC delegate a staff member must be at least a Public Service Award Administrative Officer level 3 (or equivalent).   The Asbestos management procedure outlines the delegations for asbestos management.  All new asbestos management documents including the link to the Asbestos Management Training can be found here:  Asbestos and work management"]

{"sheet":"3. Risk","index":4,"n_rows":21,"n_cols":16,"rows_kept":21,"cut":false,"hidden":false,"merged":[[5,2,5,5],[11,2,11,7],[11,8,11,13],[14,2,14,7],[14,8,14,13],[7,1,7,7],[10,2,10,7],[10,8,10,13],[13,2,13,7],[13,8,13,13],[9,1,9,15],[4,7,5,15],[12,2,12,7],[12,8,12,13],[20,2,20,7],[20,8,20,13],[19,2,19,7],[19,8,19,13],[15,1,15,15],[18,2,18,7],[18,8,18,13],[16,2,16,7],[16,8,16,13],[17,2,17,7],[17,8,17,13]]}
[]
[]
[]
[]
[null,"3. Risk Management",null,null,null,null,null,"This element describes the requirements and processes to support the effective identification, assessment and control of work related hazards and associated risks.  Effective HSW risk management is fundamental to ensuring safety at work.  \u0096 All Department staff should have an understanding of the HSW risk management process and how it is applied to their work. \u0096 Staff should understand and comply with relevant department risk management procedures. Processes should be established at your workplace to: \u0096 ensure staff understand the risk management process, relevant department risk management procedures and how they are to be implemented, identify, assess and manage hazards in your workplace, and\u0096 complete risks assessments for high and extreme risk health and safety hazards/activities."]
[null,"Status:",{"$f":"IF(AND(A_3.1=\"\",A_3.2=\"\",A_3.3=\"\",A_3.4=\"\",A_3.5=\"\",A_3.6=\"\",A_3.7=\"\",A_3.8=\"\",A_3.9=\"\",A_3.10=\"\"),\"Not Started - 0 of 10 Questions Answered\", IF(AND(A_3.1<>\"\",A_3.2<>\"\",A_3.3<>\"\",A_3.4<>\"\",A_3.5<>\"\",A_3.6<>\"\",A_3.7<>\"\",A_3.8<>\"\",A_3.9<>\"\",A_3.10<>\"\"),\"Complete: 10 of 10 Questions Answered\",\"In Progress - \"& COUNTA(O11:O15,O17:O21)& \" of 10 Questions Answered\"))","v":"Not Started - 0 of 10 Questions Answered"}]
[]
[null,"QUESTIONS",null,null,null,null,null,null,"GUIDELINES",null,null,null,null,null,"Y/N","YOUR NOTES"]
[]
[null,"HAZARD AND RISK MANAGEMENT"]
[null,"3.1 \nUpdated\n","Does the workplace maintain a Risk Register to record risks (with associated hazards, controls, risk rating, review) identified at the school or workplace? ",null,null,null,null,null,"The risk register is to be reviewed at least every twelve months.  A way to achieve this may be through the HSW Committee meeting.\n\nThe MyHR WHS Risk Register - Hazard Notification can be used to record hazards.  Ensure HSW Committee minutes show that hazards, risks and controls have been reviewed in the last 12 months. "]
[null,"3.2\nUpdated"," Are risks identified, assessed and controls implemented for specific activities being undertaken?  Risks that have a residual risk of high or extreme should be approved by the Principal or Officer in Charge and documented as such prior to the activity commencing.\n",null,null,null,null,null,"Refer to the Health and safety risk management webpage for information about the health and safety risk management process. There are procedures that detail how and what risk management processes is to be undertaken for specific activities. Examples where risk assessments should be documented include:\nAnaphylaxis Risk Management Plan\nFirst Aid and biological risks\nHazardous Substances\nHazardous Manual Tasks\nPlant & equipment - ITD, agriculture, grounds equipment\nHigh risk activities e.g.. working from heights, using ladders\nCurriculum (CARAs)"]
[null,"3.10\nNEW","Are psychosocial risks identified and managed with documented evidence to support this?  Evidence may include a risk register or a documented risk assessment or psychosocial risks and controls embedded into an existing protocols.",null,null,null,null,null,"Examples of psychosocial risks include (but are not limited to):   Low job control, poor support, lack of role clarity and poor organisational change management.  Further information regarding management of psychosocial risks may be found in the Managing the risk of psychosocial hazards in the workplace code of practice 2022.\nPsychological Wellbeing\nManaging the risk of psychosocial hazards at work"]
[null,"3.3\nUpdated","Are risk controls in the risk register monitored and reviewed regularly and evidence of review is available?",null,null,null,null,null,"The HSW Committee should regularly review the risk register and review a sample set of risk assessments verifying that the controls are complete or underway.  This is an important part of the review cycle of managing HSW risks."]
[null,"3.4\nUpdated","Are hazards reviewed by the HSW Committee?\n",null,null,null,null,null,"All hazards identified should be reviewed by the HSW committee to ensure the selection and implementation of controls are suitable and do not create unintended hazards.  Workplaces are to maintain a list of hazards associated with the facility and be able to identify the hazards to all visitors / contractors.  Workplaces can record hazards in the MyHR WHS Risk Register."]
[null,"WORKPLACE INSPECTIONS"]
[null,"3.5\nUpdated","Is there a documented workplace inspection program/schedule in place?  (e.g. classrooms, office buildings, walkways, cleaner's storeroom, schools officer's shed etc are subject to an inspection or checklist at least once a year)",null,null,null,null,null,"Checklists can be found on the Department's intranet as a guide to assist in understanding health and safety in specific areas. These resources may be used as part of your inspection schedule.  You may wish to table these individual checklists at your HSW Committees / Forums. "]
[null,3.6,"Are workplace inspections occurring according to schedule?",null,null,null,null,null,"Confirm against your inspection program schedule that inspections / checks are occurring as planned and can be evidenced as such within the last twelve months. For example playground inspections."]
[null,3.7,"Have all required actions from workplace inspections been completed and communicated to relevant employees?",null,null,null,null,null,"Ensure previous actions have been finalised and documented. Develop corrective action plans for outstanding hazards identified during workplace inspections. Communicate any necessary information to relevant employees (including principal, manager or supervisors) in the affected area and track progress of corrective actions via HSW Committee.  MyHR WHS Hazard Report can be used to log outstanding hazards.  "]
[null,"3.8\nUpdated","Schools that have workshop facilities / ITD curriculum:\n\nHas an assessment of practical workshops been completed? (at least once a year)\n",null,null,null,null,null,"\n\nCompletion of the “ITD Checklist Assessment of Practical Workshops” is an essential activity for identification and control of workshop hazards.  This activity is linked to an Enforceable Undertaking (EU) and maintaining records of completion is vital as you may be asked to provide evidence of completion for reporting to Workplace Health and Safety Queensland.\n\nA comprehensive assessment tool for ITD systems and processes: ITD—Check List: Assessment of Practical Workshops."]
[null,"3.9             NEW","Schools that have workshop facilities / ITD curriculum:\n\nHas a check-up been completed for each individual workshops every term?",null,null,null,null,null,"Completion of the “ITD Checklist Assessment of Practical Workshops” is an essential activity for identification and control of workshop hazards.  This activity is linked to an Enforceable Undertaking (EU) and maintaining records of completion is vital as you may be asked to provide evidence of completion for reporting to Workplace Health and Safety Queensland.\n\nA checklist designed for regular inspection of individual workshop areas:  ITD—Check List: Assessment of Practical Workshops "]

{"sheet":"4. Specific Risk","index":5,"n_rows":49,"n_cols":16,"rows_kept":49,"cut":false,"hidden":false,"merged":[[38,2,38,7],[38,8,38,13],[47,1,47,15],[43,2,43,7],[43,8,43,13],[44,2,44,7],[44,8,44,13],[45,2,45,7],[45,8,45,13],[46,8,46,13],[40,1,40,15],[39,2,39,7],[39,8,39,13],[41,2,41,7],[41,8,41,13],[42,2,42,7],[36,2,36,7],[36,8,36,13],[34,2,34,7],[34,8,34,13],[37,2,37,7],[37,8,37,13],[4,7,5,14],[7,1,7,7],[10,2,10,7],[10,8,10,13],[5,2,5,5],[9,1,9,15],[7,8,7,13],[42,8,42,13],[17,2,17,7],[17,8,17,13],[18,2,18,7],[18,8,18,13],[20,2,20,7],[20,8,20,13],[23,2,23,7],[23,8,23,13],[21,2,21,7],[21,8,21,13],[35,2,35,7],[35,8,35,13],[28,8,28,13],[29,2,29,7],[29,8,29,13],[11,2,11,7],[11,8,11,13],[12,2,12,7],[12,8,12,13],[16,2,16,7],[16,8,16,13],[13,2,13,7],[13,8,13,13],[14,2,14,7],[14,8,14,13],[15,2,15,7],[15,8,15,13],[22,2,22,7],[22,8,22,13],[19,1,19,15],[24,2,24,7],[24,8,24,13],[48,8,48,13],[48,2,48,7],[25,2,25,7],[25,8,25,13],[27,2,27,7],[27,8,27,13],[46,2,46,7],[26,1,26,15],[30,2,30,7],[30,8,30,13],[32,2,32,7],[32,8,32,13],[33,1,33,15],[31,2,31,7],[31,8,31,13],[28,2,28,7]]}
[]
[]
[]
[]
[null,"4. Specific Risks",null,null,null,null,null,"This element describes the requirements and processes to support the effective identification, assessment and control of specific work related hazards and associated risks. Effective health and safety risk management is fundamental to ensuring safety at work."]
[null,"Status:",{"$f":"IF(AND(A_4.1=\"\",A_4.2=\"\",A_4.3=\"\",A_4.4=\"\",A_4.5=\"\",A_4.6=\"\",A_4.7=\"\",A_4.8=\"\",A_4.9=\"\",A_4.10=\"\",A_4.11=\"\",A_4.12=\"\",A_4.13=\"\",A_4.14=\"\",A_4.15=\"\",A_4.16=\"\",A_4.17=\"\",A_4.18=\"\",A_4.19=\"\",A_4.20=\"\",A_4.21=\"\",A_4.22=\"\",A_4.23=\"\",A_4.24=\"\",A_4.25=\"\",A_4.26=\"\",A_4.27=\"\",A_4.28=\"\",A_4.29=\"\",A_4.30=\"\",A_4.31=\"\",A_4.32=\"\",A_4.33=\"\",A_4.34=\"\"),\"Not Started - 0 of 34 Questions Answered\",IF(AND(A_4.1<>\"\",A_4.2<>\"\",A_4.3<>\"\",A_4.4<>\"\",A_4.5<>\"\",A_4.6<>\"\",A_4.7<>\"\",A_4.8<>\"\",A_4.9<>\"\",A_4.10<>\"\",A_4.11<>\"\",A_4.12<>\"\",A_4.13<>\"\",A_4.14<>\"\",A_4.15<>\"\",A_4.16<>\"\",A_4.17<>\"\",A_4.18<>\"\",A_4.19<>\"\",A_4.20<>\"\",A_4.21<>\"\",A_4.22<>\"\",A_4.23<>\"\",A_4.24<>\"\",A_4.25<>\"\",A_4.26<>\"\",A_4.27<>\"\",A_4.28<>\"\",A_4.29<>\"\",A_4.30<>\"\",A_4.31<>\"\",A_4.32<>\"\",A_4.33<>\"\",A_4.34<>\"\"),\"Complete: 34 of 34 Questions Answered\",\"In Progress - \"& COUNTA(O11:O19,O21:O26,O28:O33,O35:O40,O42:O47,O49)& \" of 34 Questions Answered\"))","v":"Not Started - 0 of 34 Questions Answered"}]
[]
[null,"QUESTIONS",null,null,null,null,null,null,"GUIDELINES",null,null,null,null,null,"Y/N","YOUR NOTES"]
[]
[null,"CHEMICALS"]
[null,"4.1 \n","Does your workplace have a current chemical management plan (CMP)? ",null,null,null,null,null,"A range of resources are available on OnePortal at:\nHealth and Safety Initiatives\n\nThe CMP is required to be revised and renewed annually to ensure chemical management requirements are allocated and actioned over each calendar at each workplace. Each quarter your HSW Committee is to check actions are progressing and nominated roles are correct.  "]
[null,4.2,"Do you have a current manifest with vendor SDS maintained in Chemwatch to enable the generation of a hazardous chemical register? ",null,null,null,null,null,"A Chemwatch manifest is an up to date stock list of all chemicals on site. A hazardous chemical register is a record of hazardous chemicals and their vendor SDS and is required by WHS Regulation.  Your Register is a subset of your Chemwatch manifest. Use Chemwatch module 6 and module 6a to assist you with the  register."]
[null,4.3,"Do all chemical users and supervisors know how to access the Hazardous Chemical Register and Safety Data Sheets (printed or electronic)?",null,null,null,null,null,"The WHS Regulation 2011 requires that the register and safety data sheets are available and readily accessible. As the register holds safety information about hazardous chemicals, chemical users and their supervisors must know where to find it and how to access it.\nChem Watch"]
[null,"4.4 \n","Are risks associated with all chemicals in the workplace managed through documented risk assessments?",null,null,null,null,null,"• A pre-purchase risk assessment must be completed prior to the purchase of any chemical. Obtain the vendor SDS first to complete the assessment then uploaded to Chemwatch\n• Chemwatch risk assessments (ILO and UN) must be completed for all chemicals with a Chemwatch hazard rating of RED or ORANGE\n\nInformation about chemicals for cleaners and schools officers can be found on the SFOA Sharepoint.  Request access by hitting \"Send\" and access will be granted"]
[null,"4.5 \n","Are all chemicals on site (including transferred and diluted chemicals) properly stored and labelled?",null,null,null,null,null,"• Check all containers are appropriate for the chemical (suitable material and type, no food or drink containers)\n• Check all chemicals are labelled correctly according to GHS requirements\n   (use Chemwatch to generate compliant labels)\n• Check incompatible chemicals are not stored together (use Chemwatch incompatibility reports)\n• Check dangerous goods are stored according to segregation and separation requirements (appendix 9 Chemical management guideline)."]
[null,"4.6 \n","Have all chemical users and all supervisors been provided with appropriate local induction and training and a record of the training maintained?",null,null,null,null,null,"• completed online chemical management training on Education Futures Institute\n• local chemical hazards and risk management information\n• local chemical management practices\n• emergency procedures"]
[null,"4.7 \n","Has appropriate provision been made for emergency and first aid response situations involving hazardous chemicals used in the work unit?",null,null,null,null,null,"* Check spill kit and replace items as required including out of date items or items in poor condition.\n* Ensure chemical fire extinguishers are available near where chemicals are stored and used.\n* Inspect eyewashes and showers weekly and log inspections.\n* Review ILO/UN risk assessments for specific emergency needs"]
[null,4.8,"Have you done an annual chemical stocktake for all chemicals stored on site?",null,null,null,null,null,"•  Conduct a stocktake at least annually to know what you have, how much you have and where it is stored. \n• Use stocktake information to update your Chemwatch manifest as a formal record and to ensure you hold current SDS and can generate a current Hazardous chemical register."]
[null,"4.9 \n"," If required, is placarding prominently displayed where dangerous goods exceed placarding limits",null,null,null,null,null,"Refer to WHS Regulation Schedule 11, Column 4.  Use the Chemwatch placard report to identify placard requirements if required. For more information refer to the Chemical Guideline and Chemwatch module 6d."]
[null,"MANUAL HANDLING and Slips, Trips and Falls"]
[null,"4.10 \nUpdated","Have hazardous manual tasks been identified and the risks been controlled?\n\n",null,null,null,null,null,"Refer to the Manual tasks and ergonomics section of the Hazards and risks webpage (which links to the Hazardous manual tasks fact sheet and Hazardous manual tasks risk assessment template). Departmental procedures may also indicate manual tasks that typically require training in safe work practices.   \n\nAlso refer to the Hazardous manual task risk assessment template.\n\nOnline course manual tasks – assisting students with physical impairment."]
[null,4.1100000000000003,"Are storage areas organised so that frequently used and/or heavy items are stored within recommended range?",null,null,null,null,null,"Storage areas may typically include admin areas, classroom storerooms, schools officers' sheds, cleaners’ rooms, ITD, chemical storage, etc.). Consult with staff, observe and conduct \"walk around\" inspections. Refer to existing inspection checklists to identify areas of interest.\n\nConsider the need for heavy items, and/or options for substitution with lighter weight alternatives.\nReview height of items' storage (especially heavy or frequent use items). Recommended range refers to the ‘power zone’ (i.e. close to the body (therefore stored safely nearer to the edge of the shelving) between mid-thigh and mid-chest height). Ensure items are securely stored to ensure easy and safe access.\n\nEnsure that stored items do not protrude blocking or restricting movement through aisles and walkways\n\nEnsure that the storage facility is fit for purpose, in good condition, stable and secure - with weight limits observed."]
[null,4.12,"Is appropriate equipment for manual tasks readily available for use and training in its use has been provided if relevant (e.g. trolleys, hoists, platform ladders for shelving above shoulder height stored close by)? ",null,null,null,null,null,"Consider equipment suitability for the task (e.g. risk assessed, industrial rating, etc.). Research and review other equipment that may be available on the market, and refer to the Department’s supply arrangements (e.g. standing offer arrangements). Consider ease of access, location and availability of equipment.  Ensure that weight limits for ladders are legible."]
[null,4.13,"Are all materials handling equipment/trolleys maintained, cleaned and stored appropriately (i.e. according to manufacturers' instructions)?",null,null,null,null,null,"Review manufacturers’ instructions/manuals for correct equipment maintenance. Ensure equipment is in good condition and operates as designed (e.g. wheels rotate freely, handles are secure, etc.). Review maintenance logs. Consider suitable designated storage areas (i.e. away from exits and egress, etc.)."]
[null,"4.14\nUpdated","Have identified high risk hazardous manual tasks been controlled to prevent injury (e.g. progressing from manually operated bin lifters to automated, automate heavy roller doors)?",null,null,null,null,null,"Actively encourage open conversations and reporting about hazardous manual tasks.  Engage with staff about the risks and solutions or options. Regularly check for updates relating to supply arrangements, consult with suppliers/manufacturers, review catalogues etc. \nConsult with infrastructure operational support."]
[null,"4.15\nUpdated","Do you have a system in place that identifies and manages slip and trip hazards?  This may include but is not limited to a regular inspection of paths, access and egress points, general working environments.",null,null,null,null,null,"To manage slip/trip risks, speak to staff and conduct inspections to identify potential issues  Short term controls  may include reroutes / suitable equipment (i.e. ramps, trolleys, etc) until repairs or installations of new solutions. Consultation should occur with your regional infrastructure team.  hazards that are unable to rectified immediately should be logged on the MyHR Hazard Report.\n\nExamples of documented plans include:\n\nSlips, trips and falls checklist\n\nSlips, trips and falls posters for corporate offices\n\nSlips, trips and falls posters for schools\n\nPreventing slips, trips and falls information can be found here\n"]
[null,"ELECTRICAL SAFETY "]
[null,"4.16\nUpdated","Has all electrical equipment been identified and the relevant electrical safety measures scheduled?\ne.g. connection to safety switch, testing and tagging, safety switch tests?",null,null,null,null,null,"Guide to managing electrical equipment in departmental schools and workplaces\nSchools are to determine the most appropriate location for recording and tracking this information, see Section 3.7 Record Keeping in the guide.\n\nSchool is responsible for identification of equipment to be tested, electrical contractor will provide guidance and test according to AS3760, the departments guidelines  and the Qld WHS legislation.\n\nThe Service Maintenance Program is managed by the department's central office in partnership with QBuild, and includes statutory maintenance needed to meet legal and other statutory requirements. Ensure records provided by contactors are retained for 7 years.\nThe electrical safety switches are tested at intervals set by this program.\nMore information is available on the asset management strategies reference guide (blue book)."]
[null,"4.17\nUpdated","Have all scheduled safety measures been implemented and recorded for electrical equipment?\ne.g. connection to safety switches, testing of safety switches, test and tag.  This includes receipt of a service report that confirms all fixed safety switches have been tested by a licenced electrical contractor.  ",null,null,null,null,null,"This questions refers to Testing and Tagging of portable electrical equipment and Testing of fixed safety switches, see \"Guide to managing electrical equipment in departmental schools and workplaces\" (the Guide) for additional information.\n\nIf the principal/manager allows electrical equipment to be brought into the workplace by staff, has each item been risk assessed, approved for use on site and included in the workplace/school's testing/electrical management regime?  Refer to Section 1.8 in the Guide.\n\nThe Service Maintenance Program is managed by the department's central office in partnership with QBuild, and includes statutory maintenance needed to meet legal and other statutory requirements. Ensure records provided by contactors are retained for 7 years.\nThe electrical safety switches are tested at intervals set by this program.\nMore information is available on the asset management strategies reference guide (blue book)."]
[null,4.18,"Has a service report been received to confirm that tests of all fixed safety switches have been conducted by a licensed electrical worker as part of the service maintenance program?",null,null,null,null,null,"The Service Maintenance Program is managed by the department's central office in partnership with QBuild, and includes statutory maintenance needed to meet legal and other statutory requirements.\nThe electrical safety switches are tested at intervals set by this program.\nMore information is available on the asset management strategies reference guide (blue book)."]
[null,"4.19\nUpdated","Is there a process to ensure that defective electrical equipment is immediately removed from service, marked accordingly, (i.e. do not operate notice affixed), and sent for repair/condemned? ",null,null,null,null,null,"Staff should be instructed to label or tag equipment/machines as out-of-service and understand items are not be operated until safely returned to normal service.  Ensure that this process is documented clearly as instructions to staff e.g. staff inductions."]
[null,4.2,"Is electrical installation work or repair of electrical equipment only carried out by licensed electrical contractors?",null,null,null,null,null,"Electrical work may only be performed by licenced persons who are electrical contractors or employed as electricians by electrical contractors. Refer to WHSQ website for electrical licence checks\nElectrical Licence Register"]
[null,4.21,"Do you have \"Stay safer up there, switch off down here\" stickers affixed to all ceiling access panels and switchboards?",null,null,null,null,null,"The installation of these stickers provides a visual cue to contractors and staff and should be affixed to all ceiling access panels and switchboards. Affixing these stickers in the designated locations helps us create safer work practices as outlined in Part 1.9 of the Guide to managing electrical equipment in departmental schools and workplaces (i.e. turning off all power to ceiling spaces prior to contractor work). Department employees are not to access or enter ceiling spaces. If you require additional stickers, please contact your Regional Infrastructure Team.\n\nSchools can order stickers from the Electrical safety office using the form at this link: Electrical Safety \n\nSafety in ceiling spaces information can be viewed here: Ceiling Spaces"]
[null,"FACILITIES MANAGEMENT AND ASBESTOS"]
[null,"4.22\nUpdated","Has the Officer in Charge identified their delegates?\n(This applies to both facilities with ACM identified and those with no ACM).  ",null,null,null,null,null,"State owned schools where ACM has been identified are required to create a \nsite-specific asbestos management plan. There is a provision at the front of the template to nominate who the Officer in Charge and Officer in Charge Delegates are.\nA Facilities Management Team poster can also be created.\nAt state owned schools where no ACM is identified, Officers in Charge and Officer in Charge delegates can be identified through the completion of a training and delegation register."]
[null,4.2300000000000004,"Is an asbestos warning sign publicly visible and located at the central control point (e.g. reception, front counter)?",null,null,null,null,null,"If the Built Environment Materials Information Register (BEMIR) environmental status for your school states; “confirmed”, “assumed” or “unknown”, then you are required to display an asbestos warning sign. For more information refer to: Asbestos management procedure or contact your regional Infrastructure Advisor.\nA template for an Asbestos warning sign can be found in the asbestos management kit section at the bottom of the Asbestos and work management page."]
[null,"4.24\nUpdated","Does the workplace have a printed and signed copy of the site specific asbestos management plan (AMP)?",null,null,null,null,null,"Every facility with assumed or confirmed asbestos-containing material (ACM) requires an Asbestos Management Plan to be created and signed. The Asbestos Register within the electronic Built Environment Materials Information Register (BEMIR) forms part of this asbestos management plan.  This plan must be readily accessible in hard copy at the facility and available for consultation by building occupants, service providers (e.g. contractors and service personnel) and any other persons whose work or activities may have the potential to disturb ACM.                                                                                                                                                     A copy of the signed plan must be emailed to: Infrastructure.Safety@qed.qld.gov.au\n\nMore information is on the BEMIR webpage. Also, contact your regional Infrastructure Manager (IM) if you require further information."]
[null,"4.32\nUpdated","Is a copy of the asbestos register for the facility made available to facility employees, service providers and other visitors (as required)?",null,null,null,null,null,"Update the printed copy of the asbestos register immediately after a site-specific AMP is signed by the OIC.  Registers are generated through BEMIR. \nSelect the excel version for the best printing results.\nThe printed copy of the Asbestos Register can be used when BEMIR is not accessible or unavailable."]
[null,4.33,"Is there a documented process/communication identifying and managing risks associated with vehicles and traffic e.g. pick up and drop off, pedestrians, during contractor work, carparks, split campus ?",null,null,null,null,null,"Identify vehicles, traffic and / or pedestrians interactions on site (or adjacent) that affect staff, students or others, and strategies to minimise risks e.g. separation of vehicles and pedestrians, changing times of vehicle access, communication of local protocols about traffic/vehicle management \n\n• Procedure: Fleet management\n\nBrisbane City Council have provided a guide and sample template that may be referred to:\nSchool traffic management plans"]
[null,"4.34\nNEW","Do lighting levels in the school buildings and pathways appear adequate for activities, safety and security within the school?",null,null,null,null,null,"Adequate lighting levels are required for prevention of eye strain, the minimisation of trip hazards and fatigue, and for security. Non functional or non-existent lighting will impact on workplace well being and safety.\nReview must include consideration for activities that are held at the facility outside of daylight hours and/or during overcast days."]
[null,"NOISE"]
[null,4.25,"Have work areas and equipment been assessed to identify any situations where the employee is exposed to a noisy environment? ",null,null,null,null,null,"A noisy environment is generally defined as when it is difficult to hear someone speaking to you from an arm’s length or about one metre away.\n\nMusic rooms and ITD/Manual Arts workshops are noisy environments. Classrooms and work areas adjacent to these areas can also be noisy due to the overflow of noise and noise leakage into rooms.\nFactsheet: Reviewing noisy environments in schools\n\nNoisy equipment e.g. it is not only powered equipment and machinery like table saws and grinders that produce excessive noise, hand tools such as hammers and mallets impacting on a metal surface produce significant levels of noise. Other equipment such as leaf blowers, backpack vacuum cleaners, mowers, sporting event starter guns are noisy equipment."]
[null,"4.26         Updated","Have identified noise risks (e.g. working with noisy equipment and working in a noisy environment) been recorded in a risk register?  (e.g. MyHR WHS Hazard Report or other register)",null,null,null,null,null,"The decibel (DB) rating can be found on equipment or in the manufacturers manual and use of the \"Reviewing noisy environments in schools\" checklist can help to identify equipment or activities."]
[null,4.2699999999999996,"Is noise considered when administrative scheduling and allocating work areas is undertaken? ",null,null,null,null,null,"Are lessons timetabled and classrooms located to reduce the overflow of noise from a noisy environment as much as possible? (e.g. music rooms into maths classrooms)"]
[null,4.28,"Are employees, students and volunteers provided with Australian Standard approved hearing protection when entering or working in noisy environments?",null,null,null,null,null,"Employees, students and volunteers need to be instructed when to wear the hearing protection, how to wear it and how to maintain it.  Disposable earplugs need to be discarded after each use. Earmuffs and earplugs need to be replaced immediately if they are damaged. If the cushions on earmuffs begin to harden the earmuff or the cushions need to be replaced. Earmuffs are to be stored away from direct sunlight when not in use."]
[null,4.29,"Are signs indicating that personal hearing protection should be worn displayed in a prominent and clear manner?",null,null,null,null,null,"Areas where employees, students and volunteers may be exposed to excessive noise should be clearly signed as a “Hearing Protection Area” at every entry point to the area. The boundaries of these areas should be clearly defined. \nNo person (including administration staff, visitors etc.) should enter a hearing protection area during normal activities unless they wear appropriate hearing protection, regardless of how long the person spends in the hearing protection area.\n\n\nBlue and white signs/pictograms indicate mandatory."]
[null,4.3,"Are required staff participating in the department’s mandatory Hearing Conservation program?",null,null,null,null,null,"Some school staff may be at higher risk of exposure to excessive noise than others. These groups include ITD/Manual Arts teachers and ITD/Manual Arts teacher aides, Instrumental Music staff, Schools Officers and some Agricultural Assistants. It is mandatory for these staff to participate in the department’s Hearing Conservation Program. The Hearing Conservation Program is aimed at achieving the safe management of noise within a workplace in response to the mandatory requirements of the Work Health and Safety Regulation 2011.\nFor more information go to the Noise section of the Hazards and risks webpage."]
[null,"OCCUPATIONAL VIOLENCE AND AGGRESSION"]
[null,"4.31\nUpdated","Have all risks (including physical and/or psychological harm, etc.) to staff, students & visitors from Occupational Violence, been assessed, and appropriate controls implemented?",null,null,null,null,null,"• Procedure: Occupational violence prevention\n\n• Handbook: School Security Handbook\n\n• Procedure: Supporting students’ mental health and wellbeing\n\nRefer to the Psychosocial COP and Inspection tool to identify potential psychosocial risks for appropriate control, and to list on the Risk register.\nFor more information go to the Hazards and risks webpage."]

{"sheet":"5. Plant Mgt","index":6,"n_rows":17,"n_cols":16,"rows_kept":17,"cut":false,"hidden":false,"merged":[[17,2,17,7],[5,2,5,5],[4,7,5,14],[7,1,7,7],[9,2,9,7],[9,8,9,13],[7,8,7,13],[10,2,10,7],[10,8,10,13],[11,2,11,7],[11,8,11,13],[12,2,12,7],[12,8,12,13],[16,2,16,7],[16,8,16,13],[14,8,14,13],[15,8,15,13],[14,2,14,7],[15,2,15,7],[13,2,13,7],[13,8,13,13]]}
[]
[]
[]
[]
[null,"5. Plant Management",null,null,null,null,null,"This element describes the requirements and processes to ensure the safe use and effective lifecycle management of plant and equipment."]
[null,"Status:",{"$f":"IF(AND(A_5.1=\"\",A_5.2=\"\",A_5.3=\"\",A_5.4=\"\",A_5.5=\"\",A_5.6=\"\",A_5.7=\"\",A_5.8=\"\"),\"Not Started - 0 of 8 Questions Answered\", IF(AND(A_5.1<>\"\",A_5.2<>\"\",A_5.3<>\"\",A_5.4<>\"\",A_5.5<>\"\",A_5.6<>\"\",A_5.7<>\"\",A_5.8<>\"\"),\"Complete: 8 of 8 Questions Answered\",\"In Progress - \"& COUNTA(O10:O17)& \" of 8 Questions Answered\"))","v":"Not Started - 0 of 8 Questions Answered"}]
[]
[null,"QUESTIONS",null,null,null,null,null,null,"GUIDELINES",null,null,null,null,null,"Y/N","YOUR NOTES"]
[]
[null,"5.1\nUpdated","Are the manufacturer's manuals and instructions accessible to staff and applicable to available plant and equipment?",null,null,null,null,null,"Schools should ensure that documents provided with an item of plant and equipment at the time of purchase, (such as operator manuals with instructions for the safe use) are kept and made readily available to staff operating the equipment.  Increasingly companies are also making these documents available electronically via their websites.\n\nRemember other types of equipment such as playgrounds, dust extraction systems, lifts etc."]
[null,5.2,"Are written safe work practices available for plant & equipment (e.g. SOPs) accessible and available to staff and students (for example ITD, Agriculture staff and students, schools officers and cleaners)?",null,null,null,null,null,"SOPs are to be reviewed regularly to ensure they remain relevant and up to date for the specific equipment in use.  Use manufacturer's instructions to inform SOPs. \n\nAdditional information, for example, on the Managing health and safety - Industrial technology and design webpage and Schools Officers page"]
[null,5.3,"Are maintenance records kept for plant and machinery?",null,null,null,null,null,"This includes Equipment Maintenance Records (EMR) for commonly used plant and equipment (linked to on ITD webpage) and equipment within Home economics, Grounds maintenance, Agriculture.\n\nAlso, refer to the Managing health and safety - Schools officers and ITD (linked above) webpages."]
[null,5.4,"Have all plant and equipment that are portable and attractive items or valued over $500 been recorded on the OneSchool Asset Register?",null,null,null,null,null,"Refer to the DoE procedure - Equipment Management for Schools    'Responsibilities - Principals & Process’"]
[null,"5.5\nUpdated","Have all lifts, escalators, moving walkways and air compressors (with hazard level -A,B or C) been registered in accordance with Schedule 5 (Part2) of the Work Health and Safety Regulation 2011.",null,null,null,null,null,"Registration and payment is to be completed by the workplace.  For additional information, please contact the school maintenance team:  SchoolMaintenance@qed.qld.gov.au\n\nEnsure all lift users are aware of safe use and emergency procedures for lifts on site."]
[null,5.6,"Is plant and equipment set up appropriately (e.g. secured to benches or floors where required), access is restricted (e.g. locked / key removed) when necessary? \n\n",null,null,null,null,null,"All items of plant, including mobile plant must be managed to ensure that it is safe to use for the purpose for which it was designed and only accessed and operated by appropriately trained people.\nManaging the risks of plant in the workplace\nFor additional information specific to ITD that includes safe working zones, guarding and hazard controls refer to the Practical design and technology (ITD) handbook"]
[null,5.7,"Have all persons who are to operate plant and equipment been provided induction, instruction and training where relevant?",null,null,null,null,null,"Refer to:  Code of practice for managing the risks of plant in the workplace\nA skills matrix may aid with keeping a track of competency and qualifications of staff. \nResources include supplier information and training tools, supervision and training, external assessors may be used to check competencies on certain equipment.\nMaintain records of training (for staff and students)"]
[null,"5.8\nNEW","Has the annual Service Maintenance program for fixed machinery in ITD workshops been completed and all recommendations have been actioned and recorded?",null,null,null,null,null,"Refer to: Service Maintenance"]

{"sheet":"6. Emergency Mgt","index":7,"n_rows":28,"n_cols":16,"rows_kept":28,"cut":false,"hidden":false,"merged":[[28,2,28,7],[18,1,18,15],[19,2,19,7],[5,2,5,5],[4,7,5,14],[7,1,7,7],[10,2,10,7],[10,8,10,13],[9,1,9,15],[15,2,15,7],[15,8,15,13],[16,2,16,7],[16,8,16,13],[17,2,17,7],[17,8,17,13],[14,1,14,15],[11,2,11,7],[11,8,11,13],[12,2,12,7],[12,8,12,13],[13,2,13,7],[13,8,13,13],[19,8,19,13],[20,2,20,7],[20,8,20,13],[27,2,27,7],[27,8,27,13],[26,2,26,7],[26,8,26,13],[25,1,25,15],[24,2,24,7],[24,8,24,13],[21,2,21,7],[21,8,21,13],[22,2,22,7],[22,8,22,13],[23,2,23,7],[23,8,23,13]]}
[]
[]
[]
[]
[null,"6. Emergency Management",null,null,null,null,null,"This element describes the requirements and processes to ensure the safety of people and property through effective prevention, preparedness and response. "]
[null,"Status:",{"$f":"IF(AND(A_6.1=\"\",A_6.2=\"\",A_6.3=\"\",A_6.4=\"\",A_6.5=\"\",A_6.6=\"\",A_6.7=\"\",A_6.8=\"\",A_6.9=\"\",A_6.10=\"\",A_6.11=\"\",A_6.12=\"\",A_6.13=\"\",A_6.14=\"\",A_6.15=\"\"),\"Not Started - 0 of 15 Questions Answered\", IF(AND(A_6.1<>\"\",A_6.2<>\"\",A_6.3<>\"\",A_6.4<>\"\",A_6.5<>\"\",A_6.6<>\"\",A_6.7<>\"\",A_6.8<>\"\",A_6.9<>\"\",A_6.10<>\"\",A_6.11<>\"\",A_6.12<>\"\",A_6.13<>\"\",A_6.14<>\"\",A_6.15<>\"\"),\"Complete: 15 of 15 Questions Answered\",\"In Progress - \"& COUNTA(O11:O14,O16,O17,O18,O20,O21,O22,O23,O24,O25,O27,O28)& \" of 15 Questions Answered\"))","v":"Not Started - 0 of 15 Questions Answered"}]
[]
[null,"QUESTIONS",null,null,null,null,null,null,"GUIDELINES",null,null,null,null,null,"Y/N","YOUR NOTES"]
[]
[null,"FIRE SAFETY"]
[null,6.1,"Is the name and contact details of the Fire Safety Advisor (FSA) displayed on the HSW noticeboard?",null,null,null,null,null,"All high occupancy buildings (more than 30 occupants) including schools, are required to appoint a Fire Safety Advisor (FSA).  For schools, FSAs in regional offices may perform this role.  \nRefer to the Fire safety advice page for further information.    \n\nA list of FSA's is available on the Fire safety advice page."]
[null,"6.2\nUpdated","Is the workplace's Fire and Evacuation Plan (FEP) current (reviewed in last 12 months) and communicated to employees, contractors and visitors with records maintained?",null,null,null,null,null,"The Fire and Evacuation Plan is current for the workplace, prominently displayed in key locations, attached to the back of the Emergency Response Plan (schools), and evidence available to demonstrate that the plan has been communicated to employees, contractors and visitors.  Each Plan must be reviewed annually with evidence of review.\nFor more information refer to Fire safety advice page."]
[null,"6.3\nUpdated","Are evacuation diagrams correct and reflect evacuation routes, assembly points, appliances and manual call points?\n\n",null,null,null,null,null,"Visually inspect each evacuation diagram in the work area, checking the date of review, orientation, mounting and legend details for the location accuracy of portable and fixed fire fighting equipment / assembly points relative to each diagram’s location, and the path to exit is correct in relation to fixed objects, such as walls and partitions.\n\nEnsure any new buildings, extensions, etc have been incorporated into the Evac diagrams\nFor more information refer to Evacuation signs and diagrams."]
[null,"6.4 \n","Is the documentation related to fire installation maintenance, staff instructions and emergency exercises retained both on site and at an external location?",null,null,null,null,null,"Note: My HR WHS is considered an \"external location\" for the purpose of recording drills. \nContact for more information:\n \u009e Infrastructure Safety\n \u009e Infrastructure Services Branch\n \u009e Regional Infrastructure Services Manager\nFire safety advice page"]
[null,"EMERGENCY DRILLS"]
[null,6.5,"Schools\nDoes the school conduct an emergency evacuation and a lockdown drill at least once per semester?\n\nOther Workplaces\nDoes the workplace conduct an emergency evacuation at least once per calendar year?",null,null,null,null,null,"Drills have been scheduled once per term (quarterly) for different types of emergencies (e.g. fire, lockdown, bomb).  Wardens have been trained in accordance with Fire Safety - Fact Sheet 3.  School Response Controller and School Response Team have been trained.\nFor more information about evacuation drill requirements and the department approach to lockdowns, contact:\nEmergency and School Security (E&SS)"]
[null,6.6,"Are records of drills and emergency responses recorded in the MyHR WHS Emergency Drill module prior to the end of each term in which the drill is conducted?",null,null,null,null,null,"Records are maintained and recorded within MyHR for all drills and actual emergency responses.  Records are kept for debrief and any corrective actions implemented to address any issues that arise.\nRefer to MyHR WHS - Emergency Drills factsheet for more information or contact Infrastructure Safety."]
[null,6.7,"Are the results of emergency/lockdown drills reviewed by the workplace management and/or the HSW Committee/School Response Coordinator/School Response Team?",null,null,null,null,null,"For information about the department approach to lockdowns contact: Emergency and School Security (E&SS)."]
[null,"PERSONNEL"]
[null,6.8,"Is there a nominated and trained Chief Fire Warden and Fire Warden in the workplace (e.g. school)?  ",null,null,null,null,null,"Their names and details should be included in the Emergency Response Plan.\nIn a school, the Principal or nominated staff member will fulfil the role as Chief Warden with Fire Warden roles tasked to teaching staff.\nThe Building Fire Safety Regulation 2008 (the regulation) and Australian Standard 3745-2010 (the standard) requires the mandatory appointment of persons responsible for carrying out the building’s evacuation coordination procedures (i.e. wardens) to all commercial buildings. \nFor more information refer to Fire Safety Fact Sheet 2 - Role of the Response Controller (Chief Warden) "]
[null,6.9,"Is the Fire Team list displayed in a prominent position? ",null,null,null,null,null,"e.g. HSW noticeboard, fire panel, etc. The template for this can be found here in the Evacuation signs, diagrams and fire safety team posters section on the Fire safety advice page.\n\nFire Safety Team posters are available on the Fire Safety Advice page"]
[null,6.1,"Is the School Response Team (SRT) list displayed in a prominent position?",null,null,null,null,null,"A template for roles of the school emergency response team can be found in Section 7 of the Emergency Response Plan template, found here. For information contact Emergency and School Security (E&SS)."]
[null,"6.11\nUpdated","Have all staff (regardless of start date) completed annual emergency procedures training, with records of training readily available?",null,null,null,null,null,"For information on mandatory training please see: Mandatory Annual Training Ready Reckoner 2024 Edition, OneInduction and the OneInduction Induction Planner\nFor information about Emergency Response Plans contact: Emergency and School Security (E&SS). \nFor information about Fire Safety training contact: Infrastructure Safety."]
[null,"6.12\nUpdated","Have those with fire evacuation coordination responsibilities (Chief Fire Warden and Fire Wardens) received site specific instruction for these roles?",null,null,null,null,null,"For more information on onsite local instruction, visit the Fire Safety advice webpage.  In some instances, Chief Fire Safety Wardens and Fire Wardens are also members within the SRT/RRT. However the roles are used in different context and training requirements may be different for each role.\nFire Safety - Fact Sheet 3\n\nRefer to your site specific emergency plan"]
[null,"6.13\nUpdated","Have all School Response Team (SRT) / Regional Response Team members been trained in their roles and responsibilities? Please see Disaster and emergency management arrangements for more information.",null,null,null,null,null,"Emergency Wardens and Chief Wardens have been trained in the emergency response plan and their responsibilities.  School Response Controller and School Response Team have been trained.\nSRT / RRT is a response team for disaster or emergent events. \nFor more information about refer to: Disaster and Emergency Management: Information Package for School Principals"]
[null,"FIRE FIGHTING APPLIANCES"]
[null,"6.14\nUpdated","Have fire protection systems been serviced at 6 and 12 monthly intervals as part of the service maintenance program and confirm actions have been closed out?  This includes: fire fighting equipment and manual call points/smoke alarms/detectors.",null,null,null,null,null,"Completed as part of the centrally managed Service Maintenance Program.\nMore information is available on the Service maintenance webpage."]
[null,"6.15\nUpdated","Are all emergency signs legible and in good condition? Do they accurately reflect the current floor plan and equipment location? Are all fire exits and emergency equipment kept clear from obstruction?",null,null,null,null,null,"Conduct a sample walk around to identify any issues.  Ensure equipment access is not obstructed and no materials are stored in the fire hose reel cupboards. Completing the Fire safety audit checklist available on the fire safety advice page, formalises your inspection and can be maintained for record keeping purposes. \nFire Extinguishers Information Sheet\nQLD Fire and Rescue Service - Advisory Notes for Fire Safety Management Tool for Owner/Occupiers\n"]

{"sheet":"7. Employee Wellbeing","index":8,"n_rows":15,"n_cols":16,"rows_kept":15,"cut":false,"hidden":false,"merged":[[9,2,9,7],[9,8,9,13],[10,2,10,7],[5,2,5,5],[7,1,7,7],[4,7,5,15],[13,2,13,7],[13,8,13,13],[14,2,14,7],[14,8,14,13],[10,8,10,13],[11,2,11,7],[11,8,11,13],[12,2,12,7],[12,8,12,13]]}
[]
[]
[]
[]
[null,"7. Employee Wellbeing",null,null,null,null,null,"This element describes the systems, processes and supporting resources to enhance staff health and wellbeing.  Healthy lifestyle programs provide staff with information and skills to help maintain good health and wellbeing.  These programs should be based on health issues identified through a needs assessment done with your local staff.  Ideally, a range of programs would be implemented to cater for a variety of individual needs.\n\nIf your school would like assistance with planning, implementing and evaluating a staff wellbeing program, contact your local Regional Wellbeing Coordinator or email: Staffwellbeing.HR@qed.qld.gov.au"]
[null,"Status:",{"$f":"IF(AND(A_7.1=\"\",A_7.2=\"\",A_7.3=\"\",A_7.4=\"\",A_7.5=\"\",A_7.6=\"\"),\"Not Started - 0 of 6 Questions Answered\", IF(AND(A_7.1<>\"\",A_7.2<>\"\",A_7.3<>\"\",A_7.4<>\"\",A_7.5<>\"\",A_7.6<>\"\"),\"Complete: 6 of 6 Questions Answered\",\"In Progress - \"& COUNTA(O10:O15)& \" of 6 Questions Answered\"))","v":"Not Started - 0 of 6 Questions Answered"}]
[]
[null,"QUESTIONS  ",null,null,null,null,null,null,"GUIDELINES",null,null,null,null,null,"Y/N","YOUR NOTES"]
[]
[null,7.1,"Is there evidence to support that the leadership team have communicated their commitment (within the current calendar year) to improving and supporting staff wellbeing?",null,null,null,null,null,"Staff wellbeing is a specific improvement agenda item within the school / workplace's strategic plan.  Leaders communicating their commitment may use forums such as a staff wellbeing commitment statement, wellbeing policy, or regular wellbeing communication (e.g. during staff meetings or newsletter)."]
[null,7.2,"Is staff wellbeing managed as a standing agenda item on the HSW Committee, or through a dedicated wellbeing committee/working group as a subset of the HSW Committee?",null,null,null,null,null,"For information about WHS Committees visit: Committees and consultation\nUsing the HSW Committee agenda/meeting template can demonstrate that Employee Wellbeing is discussed in this forum.  Ensure an Employee Wellbeing representative is included in your Terms of Reference as being a HSW Committee member."]
[null,7.3,"Has an annual needs assessment been conducted to inform a staff wellbeing action plan?",null,null,null,null,null,"An annual needs assessment is developed and disseminated to a broad cross-section of staff, such as the Healthy Workers Survey. See Staff Wellbeing Planning Guide for further details. "]
[null,7.4,"Is an annual staff wellbeing action plan developed to implement and review wellbeing initiatives, and communicated at the Wellbeing and/or HSW committees?",null,null,null,null,null,"A wellbeing action plan in an approved document comprised of a holistic range of strategies and wellbeing initiatives based on the findings of a needs assessment. See above Planning Guide for further details."]
[null,7.5,"Is the staff wellbeing action plan monitored and reviewed to inform future plans?",null,null,null,null,null,"Participation and evaluation data is captured to gauge the uptake and effectiveness of wellbeing initiatives, and outcomes communicated at Wellbeing and/or HSW Committee. This could be completed through pulse surveys, focus groups and/or other means of gaining feedback from staff. See above Planning Guide for further details. "]
[null,7.6,"Is the Employee Assistance program promoted to all staff, including promotion of the Manager’s Hotline to supervisors and managers?",null,null,null,null,null,"Information and access to the Employee Assistance Program is regularly promoted to staff, including a physical display on notice boards and other areas. Refer to the Employee Assistance Program webpage for further details."]

{"sheet":"8. Contractor","index":9,"n_rows":17,"n_cols":16,"rows_kept":17,"cut":false,"hidden":false,"merged":[[5,2,5,5],[4,7,5,14],[7,1,7,7],[12,2,12,7],[12,8,12,13],[9,2,9,7],[9,8,9,13],[10,2,10,7],[10,8,10,13],[11,2,11,7],[11,8,11,13],[15,2,15,7],[15,8,15,13],[13,2,13,7],[16,2,16,7],[16,8,16,13],[13,8,13,13],[14,2,14,7],[14,8,14,13]]}
[]
[]
[]
[]
[null,"8. Contractor Management",null,null,null,null,null,"This element describes the requirements and processes to ensure the informed engagement of external parties.\nThe Department has a legislative requirement under the Work Health and Safety Act 2011 to take every reasonable action to ensure health and safety in operational activities, including the actions of contractors under the Department’s control.\n"]
[null,"Status:",{"$f":"IF(AND(A_8.1=\"\",A_8.2=\"\",A_8.3=\"\",A_8.4=\"\",A_8.5=\"\",A_8.6=\"\",A_8.7=\"\",A_8.8=\"\"),\"Not Started - 0 of 8 Questions Answered\", IF(AND(A_8.1<>\"\",A_8.2<>\"\",A_8.3<>\"\",A_8.4<>\"\",A_8.5<>\"\",A_8.6<>\"\",A_8.7<>\"\",A_8.8<>\"\"),\"Complete: 8 of 8 Questions Answered\",\"In Progress - \"& COUNTA(O10:O17)& \" of 8 Questions Answered\"))","v":"Not Started - 0 of 8 Questions Answered"}]
[]
[null,"QUESTIONS",null,null,null,null,null,null,"GUIDELINES",null,null,null,null,null,"Y/N","YOUR NOTES"]
[]
[null,"8.1 \n","Has the school or workplace established an approved contractors (also known as service providers) list?",null,null,null,null,null,"* An approved contractor (service provider) list includes all of the relevant contractors and details required (if your school uses QBuild, the list is maintained by them).\n* If QBuild is not used, is there a regime in place to ensure contractor details are current (including registration and licensing, insurances, etc)?"]
[null,8.1999999999999993,"Is there a process for volunteers, visitors and contractors to be locally HSW inducted prior to working, with records of training maintained and readily accessible? ",null,null,null,null,null,"Everyday visitors, volunteers and contractors visit schools and sites to provide a range of services. The department is committed to maintaining a safe environment for everyone.\n\nAll volunteers, contractors and visitors must complete an induction the first time they visit any department site and update annually.\nMAST Key messages guide 2024\n\nVisitors to the site are to be easily identifiable e.g. visitor pass/lanyard and/ or escorted at all times\n\nCommunicate to individuals regarding hazards and controls that may affect their work within the workplace. Ensure contractors, visitors and others are aware of areas they are approved to access and how to report any safety concerns.\n\nFor more information visit: \nInduction and mandatory training webpage\nMAST Key Messages Guide\nMAST Key Messages Guide fact sheet"]
[null,8.3000000000000007,"Is there a process for signing in all service providers, that can be evidenced as being communicated to all staff?",null,null,null,null,null,"The workplace has a process for signing in service providers, issuing visitor passes and has documentation to demonstrate its use."]
[null,8.4,"Does the school ensure Work Area Access Permits (WAAPs) are created for all maintenance, installation, refurbishment and construction related works of any description?",null,null,null,null,null,"A WAAP is required for ALL maintenance, installation, refurbishment and construction related works of any description whether the work has the potential to disturb asbestos containing materials (ACM) or not. Therefore, every time a service provider comes on site for all building related work, a WAAP should be generated in BEMIR and issued. A start up meeting should also be conducted.\n\n\nFor more information please refer to the:\nquick reference guide for Work Area Access Permits (WAAPs)"]
[null,"8.5\nUpdated","Are WAAPs electronically closed in the Built Environment Materials Information Register (BEMIR) after the work has been completed and the physical copy of WAAP signed in accordance with the WAAP procedure.  ",null,null,null,null,null,"Once work has been completed WAAPs should be finalised in the BEMIR. This allows QBuild to update DoE facility asbestos register records from the WAAP details and any electronic data files provided by the service provider.\nFor more information visit the \"Managing service providers\" section on the School Maintenance webpage which has additional information on managing WAAPs.\n\nAsbestos management and WAAP records and retention schedule"]
[null,8.6,"Are arrangements in place for monitoring service providers to ensure they do not pose a risk to staff or students, i.e. has a risk assessment been undertaken in consultation with key stakeholders prior to the activity being undertaken?",null,null,null,null,null,"Have all HSW risks and implications of the work to be conducted by the contractor (e.g. work at height, construction work, work requiring a high risk licence been assessed for risks, and appropriate controls agreed with the contractor before being fully implemented? \n\n* Document: Working on DoE Facilities\n* Checklist: Direct to Market Contractor\n* Process: Contractor management\n\nFor example, the workplace performs regular spot checks and walk arounds whilst contractors are engaged in works to ensure that the controls identified have been implemented and working effectively and/or cease work to modify controls if they are not. "]
[null,8.6999999999999993,"Is there a non-conformance process in place for service providers, that has been communicated (and agreed) to by service providers prior to engagement of work?",null,null,null,null,null,"The workplace has a non-conformance process that is understood by employees and implemented where it is identified that service providers do not follow HSW requirements.  The workplace has documentation to highlight this.\nRefer to Working on Department of Education Facilities.\nIt is a requirement that a copy of this document is provided to all service providers prior to engaging in work on DoE facilities, schools obtain a signed agreement from the service provider (copy to service provider) and maintain for record keeping."]
[null,"8.8\nNEW","Can it be evidenced that the Officer in Charge has retained any asbestos-related enforcement notices issued to service providers?",null,null,null,null,null,"The Officer in Charge must retain a copy of any asbestos-related enforcement notices issued to service providers with contract documentation. The Officer in Charge (or the person responsible for the service provider contract if the contract is managed this way) must liaise with the service provider to ensure the risks identified in the enforcement notice are managed.  Enforcement notices can include prohibition notices, improvement notices, unsafe equipment notices or infringement notices.\nAsbestos management procedure"]

{"sheet":"9. Injury & Claims Mgt","index":10,"n_rows":15,"n_cols":16,"rows_kept":15,"cut":false,"hidden":false,"merged":[[14,2,14,7],[14,8,14,13],[11,8,11,13],[12,8,12,13],[13,2,13,7],[13,8,13,13],[12,2,12,7],[10,8,10,13],[10,2,10,7],[11,2,11,7],[5,2,5,5],[7,1,7,7],[9,2,9,7],[9,8,9,13],[4,7,5,15]]}
[]
[]
[]
[]
[null,"9. Employee Injury & Claims Mgmt",null,null,null,null,null,"This element describes the requirements to ensure effective management of injured or ill staff and support their timely return to work.  This incorporates injury management activities aimed at providing an immediate response to work injuries.  WorkCover claims, QSuper income protection claims and long term sick leave for ill or injured staff should be managed in an accurate and timely manner, and in a way that respects and upholds the rights and responsibilities of both the employee and the department."]
[null,"Status:",{"$f":"IF(AND(A_9.1=\"\",A_9.2=\"\",A_9.3=\"\",A_9.4=\"\",A_9.5=\"\",A_9.6=\"\"),\"Not Started - 0 of 6 Questions Answered\", IF(AND(A_9.1<>\"\",A_9.2<>\"\",A_9.3<>\"\",A_9.4<>\"\",A_9.5<>\"\",A_9.6<>\"\"),\"Complete: 6 of 6 Questions Answered\",\"In Progress - \"& COUNTA(O10:O15)& \" of 6 Questions Answered\"))","v":"Not Started - 0 of 6 Questions Answered"}]
[]
[null,"QUESTIONS",null,null,null,null,null,null,"GUIDELINES",null,null,null,null,null,"Y/N","YOUR NOTES"]
[]
[null,"9.1\nUpdated","Does the school or workplace have a staff member who has completed the Department's online Rehabilitation and Return to Work Coordinator (RRTWC) course? \n(if Yes, please ensure correct name/s are updated to MyHR WHS location page).",null,null,null,null,null,"Ensuring the Coordinator is appropriately qualified and trained to perform the role will assist an employer maintain a high standard of workplace assistance when suitable duties programs are required to support workers recover at work.  This is evidenced by the Department maintaining training records and a list of trained RRTWCs.\n\n\"Appropriately qualified\" means a person has the qualifications, experience or standing appropriate to perform the function or exercise the powers of a rehabilitation and return to work coordinator.\n\nThe Department provides online RRTWC training\n\nSuccessful completion of the department’s online RRTWC course within the last 3 years meets the minimum training requirements to perform the RRTWC role."]
[null,"9.2\nUpdated","If you have ill/injured staff, can the school evidence that staff have been reminded annually of their rights and responsibilities in relation to the lodgement of claims, leave entitlements, and their role in the rehabilitation process?",null,null,null,null,null,"Maintain records of communication.  This can be included as part of staff annual induction processes or during staff meetings. Ensure all employees know who the RRTWC is for their school/workplace (HSW noticeboard).  The RRTWC Factsheet provides further details on the role of Principals/Officers-In-Charge and RRTWCs to support injured/ill employee"]
[null,"9.3\nUpdated","If you have ill/injured staff, can the school evidence that injured/ill employees contacted immediately by the RRTWC and/or supervisor to discuss rehabilitation and return to work including suitable duties for work related injury?",null,null,null,null,null,"This can be evidenced by recording initial contact under \"Case Notes\" of the Incident Record reported in MyHR WHS. Early discussions with an employee can identify reasonable workplace supports and suitable duties to maintain injured/ill employees safely at work or to return injured/ill employees safely to work.  Refer to the Workplace Rehabilitation procedure."]
[null,"9.4\nUpdated","If you have ill/injured staff, can Principals, Officers-In-Charge or Supervisors evidence actively communicating with the RRTWC and injured/ill employee? ",null,null,null,null,null,"Regular communication with injured/ill employees is important for maintaining a relationship with absent injured/ill employees and ensuring reasonable support is provided for early and safe return to work. Completing Case Notes in IMS with regards to contact made with the worker, provides evidence to support this criteria."]
[null,"9.5\nUpdated","If you have ill/injured staff, can the RRTWC evidence actively engaging with the employee, Principal,  Officer-In-Charge or Supervisor, WorkCover Queensland, and treating medical practitioners to identify suitable duties and enable early return to work?",null,null,null,null,null,"Maintain records of communication.  This can be evidenced by adding all contact information into the CASE NOTES tab within the relevant IMS record.  All communication and contact made with the injured/ill worker, their treating medical practitioners and the relevant insurer to establish early intervention and coordinate return to work outcomes for the injured/ill worker, should be kept within the relevant IMS record. \nRRTWCs can use the work capabilities checklists to seek medical advice for identifying suitable duties.  Return to work plans can be recorded safely in the Injury Management module of the MyHR WHS system."]
[null,"9.6\nUpdated","If you have ill/injured staff, can the school evidence that claim and rehabilitation information/paperwork is being kept on the Injury Management System and where there may be hard copies, they are kept secure and confidential?",null,null,null,null,null,"The Injury Management module in the MyHR WHS system provides secure electronic rehabilitation case management for the use of RRTWCs.  All rehabilitation records must be retained for at least 55 years after last action, in accordance with the Document Retention Schedule."]

{"sheet":"10. Incident Mgt","index":11,"n_rows":25,"n_cols":16,"rows_kept":25,"cut":false,"hidden":false,"merged":[[24,8,24,13],[23,2,23,7],[24,2,24,7],[18,8,18,13],[17,8,17,13],[17,2,17,7],[18,2,18,7],[19,1,19,15],[23,8,23,13],[20,2,20,7],[21,2,21,7],[22,2,22,7],[20,8,20,13],[21,8,21,13],[22,8,22,13],[13,8,13,13],[15,2,15,7],[15,8,15,13],[16,2,16,7],[16,8,16,13],[13,2,13,7],[14,1,14,15],[5,2,5,5],[4,7,5,14],[7,1,7,7],[10,2,10,7],[10,8,10,13],[11,8,11,13],[9,1,9,15],[7,8,7,13],[12,2,12,7],[12,8,12,13],[11,2,11,7]]}
[]
[]
[]
[]
[null,"10. Incident Management",null,null,null,null,null,"This element describes the requirements and processes to enable individuals, workplaces and the Department to respond to incidents in a timely and effective manner so as to minimise harm and prevent recurrence."]
[null,"Status:",{"$f":"IF(AND(A_10.1=\"\",A_10.2=\"\",A_10.3=\"\",A_10.4=\"\",A_10.5=\"\",A_10.6=\"\",A_10.7=\"\",A_10.8=\"\",A_10.9=\"\",A_10.10=\"\",A_10.11=\"\",A_10.12=\"\"),\"Not Started - 0 of 13 Questions Answered\", IF(AND(A_10.1<>\"\",A_10.2<>\"\",A_10.3<>\"\",A_10.4<>\"\",A_10.5<>\"\",A_10.6<>\"\",A_10.7<>\"\",A_10.8<>\"\",A_10.9<>\"\",A_10.10<>\"\",A_10.11<>\"\",A_10.12<>\"\",A_10.13<>\"\"),\"Complete: 13 of 13 Questions Answered\",\"In Progress - \"& COUNTA(O11:O14,O16:O19,O21:O25)& \" of 13 Questions Answered\"))","v":"Not Started - 0 of 13 Questions Answered"}]
[]
[null,"QUESTIONS",null,null,null,null,null,null,"GUIDELINES",null,null,null,null,null,"Y/N","YOUR NOTES"]
[]
[null,"FIRST AID"]
[null,10.1,"Are there an appropriate number of trained first aiders in accordance with the \"Managing first aid in the workplace\" procedure?",null,null,null,null,null,"There are sufficient trained first aiders for the number of people in the workplace, all first aiders hold current First Aid qualifications from a registered training provider and records of training are maintained.   Nominated first aiders should be communicated to staff, placed on staff / HSW noticeboards and with First Aid kits.  Managed as per  Procedure: Managing first aid\n\nEnsure you consider the number of health management plans in place when you assess the number of first aiders for your workplace."]
[null,"10.2 \n","Has a first aid risk assessment been completed for the site to ensure appropriate first aid facilities in place? ",null,null,null,null,null,"First aid facilities include: first aid kits, first aid consumables/resources, and other items as determined through risk assessment, e.g. first aid room, stretcher, wheelchair, AED (defibrillator). \nFirst Aid Risk Assessment template\n\nFact Sheet: Automated External Defibrillators (AEDs) \n\nEnsure areas of higher risk e.g. workshops, Ag centres have commensurate first aid equipment and processes.\n \nThere are requirements related to Selecting and training first aiders\n\nEnsure there is evidence that the risk assessment is reviewed at least annually to ensure first aid measures are working effectively and that equipment, resources and facilities meet current workplace needs."]
[null,"10.3\nUpdated","Is there a documented regime in place that ensures that the contents of first aid kits, and the status of first aid equipment, is checked and addressed at specified intervals?",null,null,null,null,null,"This is to ensure that all kits are fully stocked and contents are “in date” at all times.  As well as checking and restocking first aid kits, this includes service and maintenance records to ensure other equipment and devices remain operational at all times.  This may include wheelchairs, stretchers, and AED (defibrillator). If defibrillator (AED) on site ensure batteries checked as per manufacturer’s instructions.\nFirst Aid checklist"]
[null,10.4,"Is the RRTWC notified of staff injuries presenting for first aid who are identified as needing rehabilitation / early intervention or may be eligible for Workers' Compensation?",null,null,null,null,null,"Evidence of RRTWC being advised may be through MyHR WHS, written protocol or other established practice."]
[null,"INCIDENT REPORTING"]
[null,"10.5\nUpdated","Is there evidence that all employees have been provided information on incident reporting, recording and reviewing incidents?",null,null,null,null,null,"Incident Management requirements have been explained to employees (evidence of training e.g. induction) including how incidents are to be reported at the workplace on the day of occurrence e.g. verbally/text to their supervisor - and how to record incidents in MyHR WHS same day or next working day. \nProcedure: Health, safety and wellbeing incident management\n\nGuide: Reporting an incident in MyHR WHS\n\nGuide: Reporting an OVA incident in MyHR WHS"]
[null,"10.6\nUpdated","Is there evidence that relevant employees have been instructed on what is a notifiable incident and when and how to notify WHSQ?",null,null,null,null,null,"Employees have been instructed on notifiable incidents and required actions (e.g. inductions records, minutes of staff meetings).\nAll supervisors are aware of notification processes and timeframes  e.g. DP, managers, HSA, HOD, BM, and others with relevant responsibilities (e.g. First Aid Officer).\nNotifiable incidents have been reported appropriately and records maintained.                            \nRefer to: HSW Incident Management Summary (includes identification of notifiables)"]
[null,"10.8\nUpdated","Are incidents in MyHR WHS reviewed in accordance with the Incident Management procedure?",null,null,null,null,null,"* Incidents are to be reviewed within specified timeframes: \n* Class 1, 2 and Dangerous Incidents – 48 hours; Class 3-5 –  5 business days.\n* Staff that have been nominated as reviewers (e.g. DPs, HODs, BMs, Supervisors) are to be provided with information to understand the review process to conduct a meaningful review, and evidence of this instruction maintained.\nReviewer info: \n\nMyHR WHS Review an Incident\n\nIncident Management Guideline\n\nHow to add columns to views (Refer example 2)"]
[null,"10.7\nUpdated","Are health and safety incidents investigated in accordance with the HSW Incident Management Procedure?",null,null,null,null,null,"* Staff undertaking investigations are to have read the procedure and supporting resources to support investigation: Injuries, incidents and investigations.  At least one staff member is to have completed the incident investigation training on QLearn (e.g. is able to be evidenced with a certificate of completion).  \n* It is recommended that other staff conducting investigations review training or resources as this provides evidence of instruction and training.  The HSW Committee can assess if all Class 3, 4, 5 incidents have been reviewed as a minimum and Class 2 incidents have a standard investigation completed.  Evidence can be found by checking MyHR WHS incidents e.g. snapshot of Class 2 incidents.\nAlso refer to: Injuries, incidents and investigations"]
[]
[null,"10.9\nNEW","Is there a system in place to ensure that asbestos-related incidents are recorded in BEMIR as per the Asbestos Management Procedure?",null,null,null,null,null,"Officer in Charge is aware of the asbestos-related incident recording timeframes detailed in the Asbestos incident management procedure.  Incidents should be recorded in BEMIR within 1 hour of being identified.\nAsbestos management procedure"]
[null,"10.10\nNEW","Can it be evidenced that asbestos-related incidents are recorded in MyHR WHS if the incident:\na) is determined to be an asbestos dangerous incident, or \nb) has led to a person to reach a belief that a member of the facility community has been exposed to airborne asbestos because of the incident. ",null,null,null,null,null,"Officer in Charge is aware of the asbestos-related incident recording timeframes detailed in the Asbestos incident management procedure"]
[null,"10.11\nNEW","Can it be evidenced that asbestos-related incidents are investigated in accordance with the Asbestos incident management procedure?",null,null,null,null,null,"All asbestos-related incidents are recorded, reported, investigated, reviewed and closed out in accordance with the requirements detailed in the Asbestos incident management procedure. The Officer in Charge has responsibilities related to:\n* Initial response and reporting\n* Actions in response to report \n* Recording asbestos-related incidents\n\nThe Officer in Charge is required to provide assistance for:\nInvestigation of asbestos-related incidents\nImplementation of corrective and preventative action\nClosure of asbestos-related incident record\n\nAsbestos management procedure"]
[null,"10.12\nNEW","Can it be evidenced that corrective and preventative actions arising from asbestos-related incidents have been implemented?",null,null,null,null,null,"The OIC must work with the Director, Infrastructure Safety to ensure any corrective and preventative actions agreed to as a result of an investigation into an asbestos-related incident are implemented and evidence attached to the incident report.  Evidence may include but is not limited to photos, documents such as meeting minutes or safety notices / emails."]
[null,"10.13\nNEW","Can it be evidenced that parents/carers have been notified of student proximity incidents arising from asbestos-related incidents?",null,null,null,null,null,"The Asbestos incident management procedure provides a definition of a student proximity incident in relation to asbestos-related incidents. When a student proximity incident occurs, the Officer in Charge must ensure a draft parent/carer letter is drafted, sent for approval and distributed."]

{"sheet":"11. Review","index":12,"n_rows":15,"n_cols":16,"rows_kept":15,"cut":false,"hidden":false,"merged":[[15,2,15,7],[15,8,15,13],[9,2,9,7],[9,8,9,13],[12,2,12,7],[12,8,12,13],[13,2,13,7],[13,8,13,13],[10,2,10,7],[10,8,10,13],[5,2,5,5],[4,7,5,14],[7,1,7,7],[11,1,11,15],[14,2,14,7],[14,8,14,13]]}
[]
[]
[]
[]
[null,"11. Review and Improvement",null,null,null,null,null,"This element describes the systems and processes to enable the identification and application of systemic and local HSW improvements."]
[null,"Status:",{"$f":"IF(AND(A_11.1=\"\",A_11.6=\"\",A_11.3=\"\",A_11.4=\"\",A_11.5=\"\"),\"Not Started - 0 of 5 Questions Answered\", IF(AND(A_11.1<>\"\",A_11.6<>\"\",A_11.3<>\"\",A_11.4<>\"\",A_11.5<>\"\"),\"Complete: 5 of 5 Questions Answered\",\"In Progress - \"& COUNTA(O10:O11,O13:O15)& \" of 5 Questions Answered\"))","v":"Not Started - 0 of 5 Questions Answered"}]
[]
[null,"QUESTIONS",null,null,null,null,null,null,"GUIDELINES",null,null,null,null,null,"Y/N","YOUR NOTES"]
[]
[null,11.1,"Are there procedures or processes in place for regularly monitoring and measuring the workplace activities in relation to HSW?",null,null,null,null,null,"e.g. inspection and maintenance schedules are actioned, corrective actions are monitored and reviewed."]
[null,"11.6\nNEW","Can it be evidenced that the Officer in Charge has carried out an annual review of the effectiveness of the facility specific asbestos management related procedures, processes and systems.",null,null,null,null,null,"The review must consider relevant incidents that have occurred for the review period considering:\nissues experienced in applying departmental procedures locally at the facility\nrecommendations proposed to address the issues experienced.\nAsbestos management procedure"]
[null,"LAST YEAR'S ASA"]
[null,"11.3\nUpdated","Is a copy of the completed ASA stored and accessible onsite AND uploaded into MyHR WHS under the Committee Module?",null,null,null,null,null,"ASAs can be uploaded to MyHR WHS Committee module"]
[null,11.4,"Was the ASA action plan for last year completed and/or items have been carried over to this year?"]
[null,11.5,"Is the ASA action plan reviewed at least each term by the HSW Committee until all actions have been completed?",null,null,null,null,null,"Note progress, and provide evidence of Action Plan progression (and planning) at the HSW Committee meeting."]

{"sheet":"12. Leadership","index":13,"n_rows":25,"n_cols":10,"rows_kept":25,"cut":false,"hidden":false,"merged":[[24,2,24,6],[24,7,24,8],[24,9,24,14],[5,2,5,5],[9,1,9,6],[9,9,9,14],[9,7,9,8],[7,1,7,14],[20,2,20,6],[20,7,20,8],[16,2,16,6],[16,7,16,8],[16,9,16,14],[20,9,20,14],[19,2,19,6],[19,7,19,8],[12,2,12,6],[23,7,23,8],[23,9,23,14],[21,2,21,6],[21,9,21,14],[21,7,21,8],[22,2,22,6],[22,9,22,14],[22,7,22,8],[23,2,23,6],[19,9,19,14],[18,2,18,6],[17,9,17,14],[18,9,18,14],[18,7,18,8],[25,2,25,6],[25,7,25,8],[25,9,25,14],[12,7,12,8],[13,2,13,6],[13,9,13,14],[13,7,13,8],[17,2,17,6],[17,7,17,8],[15,2,15,6],[15,7,15,8],[15,9,15,14],[12,9,12,14],[14,2,14,6],[14,7,14,8],[14,9,14,14]]}
[]
[]
[]
[]
[null,"12. Leadership and Governance"]
[null,"Status:",{"$f":"IF(AND(A_12.1=\"\",A_12.2=\"\",A_12.3=\"\",A_12.4=\"\",A_12.5=\"\",A_12.6=\"\",A_12.7=\"\",A_12.8=\"\",A_12.9=\"\",A_12.10=\"\",A_12.11=\"\",A_12.12=\"\",A_12.13),\"Not Started - 0 of 13 Questions Answered\", IF(AND(A_12.1<>\"\",A_12.2<>\"\",A_12.3<>\"\",A_12.4<>\"\",A_12.5<>\"\",A_12.6<>\"\",A_12.7<>\"\",A_12.8<>\"\",A_12.9<>\"\",A_12.10<>\"\",A_12.11<>\"\",A_12.12<>\"\",A_12.13<>\"\"),\"Complete: 13 of 13 Questions Answered\",\"In Progress - \"& COUNTA(H13:I25)& \" of 13 Questions Answered\"))","v":"Not Started - 0 of 13 Questions Answered"}]
[]
[null,"This element should form part of the Officer-In-Charge (e.g. Principal) review of the ASA tool completion prior to submitting.  It is not appropriate to delegate this section as this element is directly linked to demonstrating Due Diligence on the part of the OIC."]
[]
[null,"QUESTIONS",null,null,null,null,null,"Y/N",null,"YOUR NOTES"]
[]
[null,"OFFICER IN CHARGE OF WORKPLACE - TO COMPLETE  "]
[null,12.1,"Does the workplace (e.g. school) have a current staff wellbeing action plan based on findings of an annual needs assessment which is reviewed regularly?"]
[null,12.2,"Can you evidence how you made staff aware of HSW objectives, their accountabilities and commitment to work health and safety (WHS) through induction and then ongoing within the workplace?"]
[null,12.3,"Are staff with health, safety & wellbeing roles/responsibilities allocated sufficient time and resources to complete their tasks? e.g. HSA, HSR, RRTWC, Incident Investigator  \nPlease visit Managing Health and Safety for more information."]
[null,12.4,"Is the MyHR WHS Location page checked each term and updated accordingly by the OIC or DOIC?\n\nSet up your Location Screen quick reference."]
[null,12.5,"Do you play an active role in HSW at work? \n* Chairing HSW Committee\n* Providing adequate resourcing for HSW issues"]
[null,12.6,"Are there established and effective mechanisms for consultation with all staff about changes that may affect their health, safety and wellbeing such as changes to work location or roles, major works, new equipment, processes, policies or hazardous substances? "]
[null,12.7,"Is incident data, including incidents impacting psychological health and incidents involving occupational violence, regularly monitored by the workplace leadership to identify trends and ensure appropriate control measures have been implemented?"]
[null,12.8,"Is a Standard Investigation completed for Class 2 Incidents and Dangerous Incidents (including electrical incidents involving a shock to a person)?  For further information see Incidents and Investigations."]
[null,12.9,"Is there a trained Health and Safety Investigator at your school? For training, please see Health & Safety Investigator Training on QLearn"]
[null,12.1,"Does the workplace (e.g. school) have a current Safety Action Plan based on findings of the Annual Safety Assessment which is reviewed regularly? (Refer to 11.5)"]
[null,12.11,"Is an annual HSW Planning Calendar prepared at the beginning of each year incorporating proposed dates for:\n* Quarterly HSW Committee meetings including review of CMP (Refer 1.3 and 4.1)\n* Quarterly Workplace Inspection Schedule\n* Anaphylaxis risk management plan\n* Annual Review of MyHR WHS Risk Register (Refer 3.4)\n* Quarterly Emergency Drills (Refer 6.5)\n* Annual Safety Assessment (Refer 11.2)\n* Annual Chemical Stocktake\n* Annual Review of the HSW Training Register\n* Annual First Aid Risk Assessment\n\nHealth, Safety and Wellbeing - School Calendar of Activities and Events"]
[null,12.12,"Has the annual occupier statement been forwarded to QFES? \n\n• Occupier Statements are sent by QBuild to school Principals via the generic Principal email address. The statements are to be checked, signed  and forwarded to QFES by the due date.\n\n• Schools are to print out and retain a hard copy of the signed occupier statement. The signed copy should be emailed to QFES: occupier.statements@qfes.qld.gov.au\n\n• Schools are to keep an electronic file of the occupier statement on the server. This will conform to the Building Fire Safety regulation requirement to have a copy on site and a copy offsite.   \n\n• For further information contact:  QBuildSEQACR@epw.qld.gov.au"]
[null,"12.13\nNEW","Can it be evidenced that copies of asbestos-related enforcement notices are supplied to nominated people?\n\nThe OIC must ensure a copy of an asbestos-related enforcement notice issued to the department, is immediately supplied to:\n* the relevant Regional Director(schools and regional offices)\n* the relevant Regional Infrastructure Manager (schools and regional offices)\n* Director, Infrastructure Safety\n* Director, Organisational Safety and Wellbeing"]

{"sheet":"Results","index":14,"n_rows":28,"n_cols":18,"rows_kept":28,"cut":false,"hidden":false,"merged":[[26,17,26,20],[27,17,27,20],[22,6,22,8],[21,6,21,20],[27,9,27,12],[22,17,22,20],[23,17,23,20],[24,17,24,20],[25,17,25,20],[22,9,22,12],[23,9,23,12],[24,9,24,12],[25,9,25,12],[26,9,26,12],[22,13,22,16],[23,13,23,16],[24,13,24,16],[25,13,25,16],[26,13,26,16],[27,13,27,16],[20,1,20,4],[23,6,23,8],[24,6,24,8],[25,6,25,8],[26,6,26,8],[27,6,27,8],[21,1,27,4],[17,1,17,3],[16,1,16,3],[11,1,11,3],[15,1,15,3],[18,1,18,3],[12,1,12,3],[13,1,13,3],[14,1,14,3],[10,1,10,3],[5,1,5,4],[9,1,9,3],[8,1,8,3],[7,1,7,3],[6,1,6,3]]}
[]
[]
[]
[]
[]
[null,"Section Scores"]
[{"$f":"E7","v":"N/A"},{"$f":"Working!H5","v":"1. Communication & Consultation"},null,null,{"$f":"Working!L5","v":"N/A"}]
[{"$f":"E8","v":"N/A"},{"$f":"Working!H6","v":"2. HSW Capability"},null,null,{"$f":"Working!L6","v":"N/A"}]
["N/A",{"$f":"Working!H7","v":"3. Risk Management"},null,null,{"$f":"Working!L7","v":"N/A"}]
["N/A",{"$f":"Working!H8","v":"4. Specific Risk"},null,null,{"$f":"Working!L8","v":"N/A"}]
["N/A",{"$f":"Working!H9","v":"5. Plant Management"},null,null,{"$f":"Working!L9","v":"N/A"}]
["N/A",{"$f":"Working!H10","v":"6. Emergency Management"},null,null,{"$f":"Working!L10","v":"N/A"}]
["N/A",{"$f":"Working!H11","v":"7. Employee Wellbeing"},null,null,{"$f":"Working!L11","v":"N/A"}]
["N/A",{"$f":"Working!H12","v":"8. Contractor & Supplier Management"},null,null,{"$f":"Working!L12","v":"N/A"}]
["N/A",{"$f":"Working!H13","v":"9. Injury & Claims Management"},null,null,{"$f":"Working!L13","v":"N/A"}]
["N/A",{"$f":"Working!H14","v":"10. Incident Response & Management"},null,null,{"$f":"Working!L14","v":"N/A"}]
["N/A",{"$f":"Working!H15","v":"11. Review & Improvement"},null,null,{"$f":"Working!L15","v":"N/A"}]
["N/A",{"$f":"Working!H16","v":"12. Leadership & Governance"},null,null,{"$f":"Working!L16","v":"N/A"}]
[{"$f":"SUM(A7:A18)","v":0},"Overall Percentage",null,null,{"$f":"IF(ISNUMBER(Working!I22),Working!I22,\"N/A\")","v":"N/A"}]
[{"$f":"E19","v":"N/A"}]
[null,"Overall Score"]
[null,{"$f":"Working!I22","v":{"$error":"#VALUE!"}},null,null,null,"v.2024.03","Section Status"]
[null,null,null,null,null,null,{"$f":"Working!H5","v":"1. Communication & Consultation"},null,null,{"$f":"'1. Consult'!C6","v":"Not Started - 0 of 9 Questions Answered"},null,null,null,{"$f":"Working!H11","v":"7. Employee Wellbeing"},null,null,null,{"$f":"'7. Employee Wellbeing'!C6","v":"Not Started - 0 of 6 Questions Answered"}]
[null,null,null,null,null,null,{"$f":"Working!H6","v":"2. HSW Capability"},null,null,{"$f":"'2. Capability'!C6","v":"Not Started - 0 of 6 Questions Answered"},null,null,null,{"$f":"Working!H12","v":"8. Contractor & Supplier Management"},null,null,null,{"$f":"'8. Contractor'!C6","v":"Not Started - 0 of 8 Questions Answered"}]
[null,null,null,null,null,null,{"$f":"Working!H7","v":"3. Risk Management"},null,null,{"$f":"'3. Risk'!C6","v":"Not Started - 0 of 10 Questions Answered"},null,null,null,{"$f":"Working!H13","v":"9. Injury & Claims Management"},null,null,null,{"$f":"'9. Injury & Claims Mgt'!C6","v":"Not Started - 0 of 6 Questions Answered"}]
[null,null,null,null,null,null,{"$f":"Working!H8","v":"4. Specific Risk"},null,null,{"$f":"'4. Specific Risk'!C6","v":"Not Started - 0 of 34 Questions Answered"},null,null,null,{"$f":"Working!H14","v":"10. Incident Response & Management"},null,null,null,{"$f":"'10. Incident Mgt'!C6","v":"Not Started - 0 of 13 Questions Answered"}]
[null,null,null,null,null,null,{"$f":"Working!H9","v":"5. Plant Management"},null,null,{"$f":"'5. Plant Mgt'!C6","v":"Not Started - 0 of 8 Questions Answered"},null,null,null,{"$f":"Working!H15","v":"11. Review & Improvement"},null,null,null,{"$f":"'11. Review'!C6","v":"Not Started - 0 of 5 Questions Answered"}]
[null,null,null,null,null,null,{"$f":"Working!H10","v":"6. Emergency Management"},null,null,{"$f":"'6. Emergency Mgt'!C6","v":"Not Started - 0 of 15 Questions Answered"},null,null,null,{"$f":"Working!H16","v":"12. Leadership & Governance"},null,null,null,{"$f":"'12. Leadership'!C6","v":"Not Started - 0 of 13 Questions Answered"}]

{"sheet":"Action Plan","index":15,"n_rows":175,"n_cols":12,"rows_kept":175,"cut":false,"hidden":false,"merged":[[76,0,84,0],[95,1,95,9],[60,1,60,9],[134,1,134,9],[74,1,74,9],[85,1,85,9],[128,1,128,9],[121,1,121,9],[166,0,171,0],[166,1,166,9],[152,1,152,9],[86,1,86,9],[145,1,145,9],[129,1,129,9],[145,0,151,0],[112,0,120,0],[105,0,111,0],[121,0,127,0],[105,1,105,9],[102,1,102,9],[148,1,148,9],[112,1,112,9],[139,1,139,9],[128,0,144,0],[0,11,0,12],[2,1,2,9],[8,1,8,9],[11,1,11,9],[3,1,3,9],[0,0,0,2],[0,3,0,5],[2,0,14,0],[152,0,165,0],[15,0,21,0],[67,1,67,9],[91,1,91,9],[23,1,23,9],[85,0,104,0],[22,1,22,9],[22,0,34,0],[15,1,15,9],[76,1,76,9],[29,1,29,9],[36,1,36,9],[53,1,53,9],[46,1,46,9],[35,1,35,9],[35,0,75,0]]}
[{"$f":"\"Health, Safety and Wellbeing\"&CHAR(10)&\"Annual Safety Assessment 2024\"&CHAR(10)&\"Action Plan - \"&Workplace_Name","v":"Health, Safety and Wellbeing\nAnnual Safety Assessment 2024\nAction Plan - "},null,null,"Recommended completion timeframes for Priority:\nP1 - Within 1 Month\nP2 - Within 2 Months\nP3 - Within 4 Months\nP4 - Within 6 Months",null,null,null,null,null,{"$f":"Results!F22","v":"v.2024.03"}]
["Section","Question Number","Requirement / Element","Result","Actions to be Completed","Priority","Notes from Audit Pages","Additional Comments\n(completed by Work Area)","Action Officer","Completed"]
["1. Communication and Consultation","1. COMMUNICATION & CONSULTATION"]
[null,"WORKPLACE HEALTH & SAFETY COMMITTEE"]
[null,1.1000000000000001,{"$f":"'1. Consult'!C11","v":"Are the details of your Health, Safety and Wellbeing (HSW) committee or consultation forum updated each year in the MyHR WHS Committees module to ensure details remain current?"},{"$f":"IF(A_1.1=0,\"\",A_1.1)","v":""},{"$f":"IF(D5=\"no\",$L5,\"\")","v":""},{"$f":"IF(D5=\"no\",$K5,\"\")","v":""},{"$f":"N_1.1","v":0},null,null,{"$f":"IF(OR(D5=\"Yes\",D5=\"Not Applicable\"),\"Completed\",\"\")","v":""},"P2","Ensure details of the HSW Committee/Forum is updated in your MyHR Committee record.  "]
[null,1.2,{"$f":"'1. Consult'!C12","v":"Is the HSW committee or forum chaired by the Principal / Manager / Director / Regional Director?"},{"$f":"IF(A_1.2=0,\"\",A_1.2)","v":""},{"$f":"IF(D6=\"no\",$L6,\"\")","v":""},{"$f":"IF(D6=\"no\",$K6,\"\")","v":""},{"$f":"N_1.2","v":0},null,null,{"$f":"IF(OR(D6=\"Yes\",D6=\"Not Applicable\"),\"Completed\",\"\")","v":""},"P2","Establish the chair as one of the listed positions."]
[null,"1.3",{"$f":"'1. Consult'!C13","v":"Are meetings held at least once a term (using the agenda template as a guide to ensure all topics are covered) and recorded in MyHR WHS Committee Meeting Mgmt (Meeting) module, and finalised (closed) before the end of each term?"},{"$f":"IF(A_1.3=0,\"\",A_1.3)","v":""},{"$f":"IF(D7=\"no\",$L7,\"\")","v":""},{"$f":"IF(D7=\"no\",$K7,\"\")","v":""},{"$f":"N_1.3","v":0},null,null,{"$f":"IF(OR(D7=\"Yes\",D7=\"Not Applicable\"),\"Completed\",\"\")","v":""},"P3","Hold committee or forum meetings at least once per term and upload minutes to appropriate MyHR WHS module."]
[null,"1.4",{"$f":"'1. Consult'!C14","v":"Has a current terms of reference (ToR) been developed at the beginning of the school year (Term 1) AND discussed and endorsed at the first HSW Committee AND the endorsed TOR uploaded in the MyHR WHS Committee Meeting Mgmt (Committee) module (not the (Meeting) module)?"},{"$f":"IF(A_1.4=0,\"\",A_1.4)","v":""},{"$f":"IF(D8=\"no\",$L8,\"\")","v":""},{"$f":"IF(D8=\"no\",$K8,\"\")","v":""},{"$f":"N_1.4","v":0},null,null,{"$f":"IF(OR(D8=\"Yes\",D8=\"Not Applicable\"),\"Completed\",\"\")","v":""},"P3","Create and endorse a Terms of Reference at the next scheduled committee meeting."]
[null,"HEALTH & SAFETY REPRESENTATIVES"]
[null,"1.5",{"$f":"'1. Consult'!C16","v":"Have all employees at the location been told of their right to elect a Health and Safety Representative (HSR)?\n\nNB: Work groups may chose not to elect a HSR. \n       Do not confuse (elected ) HSR and (appointed) Health and Safety Advisors (HSA)\n       roles."},{"$f":"IF(A_1.5=0,\"\",A_1.5)","v":""},{"$f":"IF(D10=\"no\",$L10,\"\")","v":""},{"$f":"IF(D10=\"no\",$K10,\"\")","v":""},{"$f":"N_1.5","v":0},null,null,{"$f":"IF(OR(D10=\"Yes\",D10=\"Not Applicable\"),\"Completed\",\"\")","v":""},"P3","Advise all workers at the workplace of their right to elect a HSR - provide link to factsheet to all at induction and place on HSW noticeboard.  Where requested by the workforce undertake the election of a health and safety representative (HSR)."]
[null,"1.6",{"$f":"'1. Consult'!C17","v":"If elected and trained has the name of the elected Health & Safety Representative been recorded in the MyHR WHS Location page and displayed on relevant noticeboards?"},{"$f":"IF(A_1.6=0,\"\",A_1.6)","v":""},{"$f":"IF(D11=\"no\",$L11,\"\")","v":""},{"$f":"IF(D11=\"no\",$K11,\"\")","v":""},{"$f":"N_1.6","v":0},null,null,{"$f":"IF(OR(D11=\"Yes\",D11=\"Not Applicable\"),\"Completed\",\"\")","v":""},"P3","Record the name of the elected Health and Safety Rep is the MyHR Location Details screen AND display at the workplace.  "]
[null,"HEALTH & SAFETY COMMUNICATION"]
[null,"1.7",{"$f":"'1. Consult'!C19","v":"Has the school/workplace established a documented way to communicate HSW matters? e.g. a noticeboard (physical or electronic)"},{"$f":"IF(A_1.7=0,\"\",A_1.7)","v":""},{"$f":"IF(D13=\"no\",$L13,\"\")","v":""},{"$f":"IF(D13=\"no\",$K13,\"\")","v":""},{"$f":"N_1.7","v":0},null,null,{"$f":"IF(OR(D13=\"Yes\",D13=\"Not Applicable\"),\"Completed\",\"\")","v":""},"P2","Establish a HSW noticeboard and display required documents.   Ensure a process is in place to ensure the accuracy of information on the noticeboard is maintained."]
[null,"1.8",{"$f":"'1. Consult'!C20","v":"Is an agreed HSW Issue Resolution process prominently displayed in the workplace?"},{"$f":"IF(A_1.8=0,\"\",A_1.8)","v":""},{"$f":"IF(D14=\"no\",$L14,\"\")","v":""},"",{"$f":"N_1.8","v":0},null,null,"","P2","Display the HSW Issue Resolution process (i.e. flowchart) prominently in the workplace."]
[null,"1.9",{"$f":"'1. Consult'!C21","v":"The school/workplace has established a documented and approved process for consultation on HSW matters specific to the workplace?"},{"$f":"IF(A_1.9=0,\"\",A_1.9)","v":""},{"$f":"IF(D15=\"no\",$L15,\"\")","v":""},"",{"$f":"N_1.9","v":0},null,null,"","P2","Establish a method for consulting on and communicating HSW matters."]
["2. HSW Capability","2. HSW CAPABILITY"]
[null,2.1,{"$f":"'2. Capability'!C10","v":"Is local (site based) HSW Induction provided for all newly appointed staff and staff returning from extended absence (e.g. 12 months), with evidence available to support date of induction and content of induction?"},{"$f":"IF(A_2.1=0,\"\",A_2.1)","v":""},{"$f":"IF(D17=\"no\",$L17,\"\")","v":""},"",{"$f":"N_2.1","v":0},null,null,"","P1","Arrange for identified employees to complete HSW induction."]
[null,"2.2",{"$f":"'2. Capability'!C11","v":"Has Mandatory Training been undertaken by all staff (as per the Ready Reckoner) and evidence maintained?"},{"$f":"IF(A_2.2=0,\"\",A_2.2)","v":""},"","",{"$f":"N_2.2","v":0},null,null,"","P1","Arrange for identified employees to complete HSW mandatory training."]
[null,"2.3",{"$f":"'2. Capability'!C12","v":"Have HSW training needs been identified in consultation with employees and scheduled into professional development plans for the year?"},{"$f":"IF(A_2.3=0,\"\",A_2.3)","v":""},"","",{"$f":"N_2.3","v":0},null,null,"","P3","Conduct a training needs analysis."]
[null,"2.4",{"$f":"'2. Capability'!C13","v":"Have the training needs of all HSW roles [i.e. Health Safety Advisor (HSA), Rehabilitation and RTW Coordinator (RRTWC), Health and Safety Representatives (HSR) and First Aid Officer] been identified, scheduled and completed with evidence on training maintained?"},{"$f":"IF(A_2.4=0,\"\",A_2.4)","v":""},"","",{"$f":"N_2.4","v":0},null,null,"","P2","Identify the training needs of the identified positions and schedule as appropriate."]
[null,"2.5",{"$f":"'2. Capability'!C14","v":"The details of HSA, HSR and RRTWC are up to date and kept current in the MyHR WHS Administration Location Page."},{"$f":"IF(A_2.5=0,\"\",A_2.5)","v":""},"","",{"$f":"N_2.5","v":0},null,null,"","P2","Update the MyHR WHS Administration Location page."]
[null,"2.6",{"$f":"'2. Capability'!C15","v":"Have identified staff completed the Asbestos management training and records of training are maintained? Identified staff include the \"Officer in Charge\" (OIC) and their nominated delegates as per the Mandatory Annual Training - Ready Reckoner: 2024 Edition."},{"$f":"IF(A_2.6=0,\"\",A_2.6)","v":""},"","",{"$f":"N_2.6","v":0},null,null,"","P1","Staff in identified positions for asbestos management to complete AMT training."]
["3. Health & Safety Risk Management","3. HEALTH & SAFETY RISK MANAGEMENT"]
[null,"RISK REGISTER"]
[null,"3.1",{"$f":"Q3.1","v":"Does the workplace maintain a Risk Register to record risks (with associated hazards, controls, risk rating, review) identified at the school or workplace? "},{"$f":"IF(A_3.1=0,\"\",A_3.1)","v":""},{"$f":"IF(D25=\"no\",$L25,\"\")","v":""},{"$f":"IF(D25=\"no\",$K25,\"\")","v":""},{"$f":"N_3.1","v":0},null,null,{"$f":"IF(OR(D25=\"Yes\",D25=\"Not Applicable\"),\"Completed\",\"\")","v":""},"P3","Use MyHR WHS Risk Register to record hazards."]
[null,"3.2",{"$f":"Q3.2","v":" Are risks identified, assessed and controls implemented for specific activities being undertaken?  Risks that have a residual risk of high or extreme should be approved by the Principal or Officer in Charge and documented as such prior to the activity commencing.\n"},{"$f":"IF(A_3.2=0,\"\",A_3.2)","v":""},{"$f":"IF(D26=\"no\",$L26,\"\")","v":""},{"$f":"IF(D26=\"no\",$K26,\"\")","v":""},{"$f":"N_3.2","v":0},null,null,{"$f":"IF(OR(D26=\"Yes\",D26=\"Not Applicable\"),\"Completed\",\"\")","v":""},"P3","Sample and review controls and refer to the HSW Committee as required."]
[null,"3.10",{"$f":"Q3.10","v":"Are psychosocial risks identified and managed with documented evidence to support this?  Evidence may include a risk register or a documented risk assessment or psychosocial risks and controls embedded into an existing protocols."},{"$f":"IF(A_3.10=0,\"\",A_3.10)","v":""},{"$f":"IF(D27=\"no\",$L27,\"\")","v":""},{"$f":"IF(D27=\"no\",$K27,\"\")","v":""},{"$f":"+N_3.10","v":0},null,null,{"$f":"IF(OR(D27=\"Yes\",D27=\"Not Applicable\"),\"Completed\",\"\")","v":""},"P2","Conduct a risk assessment to identify psychosocial risks and document identified risks and controls."]
[null,"3.3",{"$f":"Q3.3","v":"Are risk controls in the risk register monitored and reviewed regularly and evidence of review is available?"},{"$f":"IF(A_3.3=0,\"\",A_3.3)","v":""},{"$f":"IF(D28=\"no\",$L28,\"\")","v":""},{"$f":"IF(D28=\"no\",$K28,\"\")","v":""},{"$f":"N_3.3","v":0},null,null,{"$f":"IF(OR(D28=\"Yes\",D28=\"Not Applicable\"),\"Completed\",\"\")","v":""},"P3","Complete Risk Assessments as identified."]
[null,"3.4",{"$f":"Q3.4","v":"Are hazards reviewed by the HSW Committee?\n"},{"$f":"IF(A_3.4=0,\"\",A_3.4)","v":""},{"$f":"IF(D29=\"no\",$L29,\"\")","v":""},{"$f":"IF(D29=\"no\",$K29,\"\")","v":""},{"$f":"N_3.4","v":0},null,null,{"$f":"IF(OR(D29=\"Yes\",D29=\"Not Applicable\"),\"Completed\",\"\")","v":""},"P3","Identify and record hazards within the MyHR WHS Risk Register Module."]
[null,"WORKPLACE INSPECTIONS"]
[null,"3.5",{"$f":"Q3.5","v":"Is there a documented workplace inspection program/schedule in place?  (e.g. classrooms, office buildings, walkways, cleaner's storeroom, schools officer's shed etc are subject to an inspection or checklist at least once a year)"},{"$f":"IF(A_3.5=0,\"\",A_3.5)","v":""},{"$f":"IF(D31=\"no\",$L31,\"\")","v":""},{"$f":"IF(D31=\"no\",$K31,\"\")","v":""},{"$f":"N_3.5","v":0},null,null,{"$f":"IF(OR(D31=\"Yes\",D31=\"Not Applicable\"),\"Completed\",\"\")","v":""},"P3","Implement a workplace inspection program."]
[null,"3.6",{"$f":"Q3.6","v":"Are workplace inspections occurring according to schedule?"},{"$f":"IF(A_3.6=0,\"\",A_3.6)","v":""},{"$f":"IF(D32=\"no\",$L32,\"\")","v":""},{"$f":"IF(D32=\"no\",$K32,\"\")","v":""},{"$f":"N_3.6","v":0},null,null,{"$f":"IF(OR(D32=\"Yes\",D32=\"Not Applicable\"),\"Completed\",\"\")","v":""},"P3","Report inspection completion rates (against the schedule) at the HSW committee meeting for noting.  Identify and report why workplace inspections are not occurring to schedule and note action to remediate."]
[null,"3.7",{"$f":"Q3.7","v":"Have all required actions from workplace inspections been completed and communicated to relevant employees?"},{"$f":"IF(A_3.7=0,\"\",A_3.7)","v":""},{"$f":"IF(D33=\"no\",$L33,\"\")","v":""},{"$f":"IF(D33=\"no\",$K33,\"\")","v":""},{"$f":"N_3.7","v":0},null,null,{"$f":"IF(OR(D33=\"Yes\",D33=\"Not Applicable\"),\"Completed\",\"\")","v":""},"P3","Review outstanding workplace inspection actions and communicate as appropriate."]
[null,"3.8",{"$f":"Q3.8","v":"Schools that have workshop facilities / ITD curriculum:\n\nHas an assessment of practical workshops been completed? (at least once a year)\n"},{"$f":"IF(A_3.8=0,\"\",A_3.8)","v":""},{"$f":"IF(D34=\"no\",$L34,\"\")","v":""},{"$f":"IF(D34=\"no\",$K34,\"\")","v":""},{"$f":"N_3.8","v":0},null,null,{"$f":"IF(OR(D34=\"Yes\",D34=\"Not Applicable\"),\"Completed\",\"\")","v":""},"P1","This activity is linked to an Enforceable Undertaking (EU) and maintaining records of completion is vital as you may be asked to provide evidence of completion for reporting to Workplace Health and Safety Queensland.\nComplete an assessment of practical workshops and manage completion of outstanding activities or processes.  Schedule and complete a ‘check-up’ of each practical workshop every term.  "]
[null,"3.9",{"$f":"Q3.9","v":"Schools that have workshop facilities / ITD curriculum:\n\nHas a check-up been completed for each individual workshops every term?"},{"$f":"IF(A_3.9=0,\"\",A_3.9)","v":""},{"$f":"IF(D35=\"no\",$L35,\"\")","v":""},{"$f":"IF(D35=\"no\",$K35,\"\")","v":""},{"$f":"N_3.9","v":0},null,null,{"$f":"IF(OR(D35=\"Yes\",D35=\"Not Applicable\"),\"Completed\",\"\")","v":""},"P1","Conduct a documented inspection of workshops each term.\nThis activity is linked to an Enforceable Undertaking (EU) and maintaining records of completion is vital as you may be asked to provide evidence of completion for reporting to Workplace Health and Safety Queensland."]
["4. Specific Risks","4. SPECIFIC RISKS"]
[null,"CHEMICALS"]
[null,"4.1",{"$f":"Q4.1","v":"Does your workplace have a current chemical management plan (CMP)? "},{"$f":"IF(A_4.1=0,\"\",A_4.1)","v":""},{"$f":"IF(D38=\"no\",$L38,\"\")","v":""},{"$f":"IF(D38=\"no\",$K38,\"\")","v":""},{"$f":"N_4.1","v":0},null,null,{"$f":"IF(OR(D38=\"Yes\",D38=\"Not Applicable\"),\"Completed\",\"\")","v":""},"P3","Complete CMP - have it signed and dated by Principal (to demonstrate currency and approval).\nMake the CMP accessible to staff at your workplace; communicate the plan to all staff.\nCheck in progress or issues at your HSW Committee meeting."]
[null,"4.2",{"$f":"Q4.2","v":"Do you have a current manifest with vendor SDS maintained in Chemwatch to enable the generation of a hazardous chemical register? "},{"$f":"IF(A_4.2=0,\"\",A_4.2)","v":""},"","",{"$f":"N_4.2","v":0},null,null,"","P3","Conduct a stocktake and update your manifest so that the manifest reflects the stock held on shelves. Obtain any missing vendor SDS."]
[null,"4.3",{"$f":"Q4.3","v":"Do all chemical users and supervisors know how to access the Hazardous Chemical Register and Safety Data Sheets (printed or electronic)?"},{"$f":"IF(A_4.3=0,\"\",A_4.3)","v":""},"","",{"$f":"N_4.3","v":0},null,null,"","P3","Schedule training and share information to ensure relevant persons demonstrate capability to access the register."]
[null,"4.4",{"$f":"Q4.4","v":"Are risks associated with all chemicals in the workplace managed through documented risk assessments?"},{"$f":"IF(A_4.4=0,\"\",A_4.4)","v":""},"","",{"$f":"N_4.4","v":0},null,null,"","P3","Complete Risk Assessments as identified. "]
[null,"4.5",{"$f":"Q4.5","v":"Are all chemicals on site (including transferred and diluted chemicals) properly stored and labelled?"},{"$f":"IF(A_4.5=0,\"\",A_4.5)","v":""},"","",{"$f":"N_4.5","v":0},null,null,"","P3","Correct issues identified with decanted containers and labels. Print compliant labels from Chemwatch."]
[null,"4.6",{"$f":"Q4.6","v":"Have all chemical users and all supervisors been provided with appropriate local induction and training and a record of the training maintained?"},{"$f":"IF(A_4.6=0,\"\",A_4.6)","v":""},"","",{"$f":"N_4.6","v":0},null,null,"","P3","Schedule and record training as identified. "]
[null,"4.7",{"$f":"Q4.7","v":"Has appropriate provision been made for emergency and first aid response situations involving hazardous chemicals used in the work unit?"},{"$f":"IF(A_4.7=0,\"\",A_4.7)","v":""},"","",{"$f":"N_4.7","v":0},null,null,"","P3","Provide appropriate emergency and first aid equipment according to the nature of the substances identified in the area."]
[null,"4.8",{"$f":"Q4.8","v":"Have you done an annual chemical stocktake for all chemicals stored on site?"},{"$f":"IF(A_4.8=0,\"\",A_4.8)","v":""},"","",{"$f":"N_4.8","v":0},null,null,"","P3","Conduct a stocktake of all chemicals in all storage locations on site and update the Chemwatch manifest."]
[null,"4.9",{"$f":"Q4.9","v":" If required, is placarding prominently displayed where dangerous goods exceed placarding limits"},{"$f":"IF(A_4.9=0,\"\",A_4.9)","v":""},"","",{"$f":"N_4.9","v":0},null,null,"","P3","Correct placarding issues as identified – use Chemwatch to determine placard requirements."]
[null,"MANUAL HANDLING"]
[null,"4.10",{"$f":"Q4.10","v":"Have hazardous manual tasks been identified and the risks been controlled?\n\n"},{"$f":"IF(A_4.10=0,\"\",A_4.10)","v":""},{"$f":"IF(D48=\"no\",$L48,\"\")","v":""},{"$f":"IF(D48=\"no\",$K48,\"\")","v":""},{"$f":"N_4.10","v":0},null,null,{"$f":"IF(OR(D48=\"Yes\",D48=\"Not Applicable\"),\"Completed\",\"\")","v":""},"P3","Schedule and deliver training to identified staff."]
[null,"4.11",{"$f":"Q4.11","v":"Are storage areas organised so that frequently used and/or heavy items are stored within recommended range?"},{"$f":"IF(A_4.11=0,\"\",A_4.11)","v":""},"","",{"$f":"N_4.11","v":0},null,null,"","P3","Reorganise storage areas according to manual handling requirements."]
[null,"4.12",{"$f":"Q4.12","v":"Is appropriate equipment for manual tasks readily available for use and training in its use has been provided if relevant (e.g. trolleys, hoists, platform ladders for shelving above shoulder height stored close by)? "},{"$f":"IF(A_4.12=0,\"\",A_4.12)","v":""},"","",{"$f":"N_4.12","v":0},null,null,"","P4","Obtain appropriate equipment for manual handling.  Review ladders, ensure compliant and suitable for tasks."]
[null,"4.13",{"$f":"Q4.13","v":"Are all materials handling equipment/trolleys maintained, cleaned and stored appropriately (i.e. according to manufacturers' instructions)?"},{"$f":"IF(A_4.13=0,\"\",A_4.13)","v":""},"","",{"$f":"N_4.13","v":0},null,null,"","P3","Conduct maintenance checks for identified equipment and review storage issues."]
[null,"4.14",{"$f":"Q4.14","v":"Have identified high risk hazardous manual tasks been controlled to prevent injury (e.g. progressing from manually operated bin lifters to automated, automate heavy roller doors)?"},{"$f":"IF(A_4.14=0,\"\",A_4.14)","v":""},"","",{"$f":"N_4.14","v":0},null,null,"","P4","Introduce a process for reviewing and updating equipment in line with advances in technology."]
[null,"4.15",{"$f":"Q4.15","v":"Do you have a system in place that identifies and manages slip and trip hazards?  This may include but is not limited to a regular inspection of paths, access and egress points, general working environments."},{"$f":"IF(A_4.15=0,\"\",A_4.15)","v":""},"","",{"$f":"N_4.15","v":0},null,null,"","P4","Submit the appropriate work areas / requests for issues with floor surfaces and/or pathways as identified."]
[null,"ELECTRICAL SAFETY"]
[null,"4.16",{"$f":"Q4.16","v":"Has all electrical equipment been identified and the relevant electrical safety measures scheduled?\ne.g. connection to safety switch, testing and tagging, safety switch tests?"},{"$f":"IF(A_4.16=0,\"\",A_4.16)","v":""},{"$f":"IF(D55=\"no\",$L55,\"\")","v":""},{"$f":"IF(D55=\"no\",$K55,\"\")","v":""},{"$f":"N_4.16","v":0},null,null,{"$f":"IF(OR(D55=\"Yes\",D55=\"Not Applicable\"),\"Completed\",\"\")","v":""},"P3","Identify all portable and fixed electrical equipment, existing and new, which requires test and tag by physical inspection of resources and reference to previous test and tag records. Ensure records are kept and that equipment required to tested and tagged is presented for test."]
[null,"4.17",{"$f":"Q4.17","v":"Have all scheduled safety measures been implemented and recorded for electrical equipment?\ne.g. connection to safety switches, testing of safety switches, test and tag.  This includes receipt of a service report that confirms all fixed safety switches have been tested by a licenced electrical contractor.  "},{"$f":"IF(A_4.17=0,\"\",A_4.17)","v":""},"","",{"$f":"N_4.17","v":0},null,null,"","P3","Arrange for testing of electrical equipment including residual current devices (RCDs) and keep records for at least 7 years."]
[null,"4.18",{"$f":"Q4.18","v":"Has a service report been received to confirm that tests of all fixed safety switches have been conducted by a licensed electrical worker as part of the service maintenance program?"},{"$f":"IF(A_4.18=0,\"\",A_4.18)","v":""},"","",{"$f":"N_4.18","v":0},null,null,"","P2","Include testing of fixed electrical safety switches in the Department's Service Maintenance Program."]
[null,"4.19",{"$f":"Q4.19","v":"Is there a process to ensure that defective electrical equipment is immediately removed from service, marked accordingly, (i.e. do not operate notice affixed), and sent for repair/condemned? "},{"$f":"IF(A_4.19=0,\"\",A_4.19)","v":""},"","",{"$f":"N_4.19","v":0},null,null,"","P2","Establish a process so that defective equipment is immediately removed  from service, marked as do not operate, and sent for repair or condemned."]
[null,"4.20",{"$f":"Q4.20","v":"Is electrical installation work or repair of electrical equipment only carried out by licensed electrical contractors?"},{"$f":"IF(A_4.20=0,\"\",A_4.20)","v":""},"","",{"$f":"N_4.20","v":0},null,null,"","P1","Ensure electrical work is undertaken only be licenced electricians"]
[null,"4.21",{"$f":"Q4.21","v":"Do you have \"Stay safer up there, switch off down here\" stickers affixed to all ceiling access panels and switchboards?"},{"$f":"IF(A_4.21=0,\"\",A_4.21)","v":""},"","",{"$f":"N_4.21","v":0},null,null,"","P2","Place \"Stay safer up there, switch off down here\" stickers affixed to all ceiling access panels and switchboards if none present. If you require additional stickers, please contact your Regional Infrastructure Team."]
[null,"FACILITIES MANAGEMENT/ASBESTOS"]
[null,"4.22",{"$f":"Q4.22","v":"Has the Officer in Charge identified their delegates?\n(This applies to both facilities with ACM identified and those with no ACM).  "},{"$f":"IF(A_4.22=0,\"\",A_4.22)","v":""},{"$f":"IF(D62=\"no\",$L62,\"\")","v":""},{"$f":"IF(D62=\"no\",$K62,\"\")","v":""},{"$f":"N_4.22","v":0},null,null,{"$f":"IF(OR(D62=\"Yes\",D62=\"Not Applicable\"),\"Completed\",\"\")","v":""},"P1","Building Manager (e.g. school principal) to assign members of staff to AMT or FMT roles.  Complete the relevant editable poster with all current team members and display in the staffroom."]
[null,"4.23",{"$f":"Q4.23","v":"Is an asbestos warning sign publicly visible and located at the central control point (e.g. reception, front counter)?"},{"$f":"IF(A_4.23=0,\"\",A_4.23)","v":""},{"$f":"IF(D63=\"no\",$L63,\"\")","v":""},"",{"$f":"N_4.23","v":0},null,null,"","P2","Display an asbestos warning sign which is publicly visible and located at the central control point (e.g. reception, front counter)."]
[null,"4.24",{"$f":"Q4.24","v":"Does the workplace have a printed and signed copy of the site specific asbestos management plan (AMP)?"},{"$f":"IF(A_4.24=0,\"\",A_4.24)","v":""},{"$f":"IF(D64=\"no\",$L64,\"\")","v":""},"",{"$f":"N_4.24","v":0},null,null,"","P2","Contact your regional Infrastructure Advisor for advice."]
[null,"4.32",{"$f":"Q4.32","v":"Is a copy of the asbestos register for the facility made available to facility employees, service providers and other visitors (as required)?"},{"$f":"IF(A_4.32=0,\"\",A_4.32)","v":""},{"$f":"IF(D65=\"no\",$L65,\"\")","v":""},"",{"$f":"N_4.32","v":0},null,null,"","P4","Ensure a copy of the asbestos register is printed every six months."]
[null,"4.33",{"$f":"Q4.33","v":"Is there a documented process/communication identifying and managing risks associated with vehicles and traffic e.g. pick up and drop off, pedestrians, during contractor work, carparks, split campus ?"},{"$f":"IF(A_4.33=0,\"\",A_4.33)","v":""},{"$f":"IF(D66=\"no\",$L66,\"\")","v":""},"",{"$f":"N_4.33","v":0},null,null,"","P2","Ensure vehicle and traffic management strategies are communicated to staff, students, contractors and visitors to enable implementation "]
[null,"4.34",{"$f":"Q4.34","v":"Do lighting levels in the school buildings and pathways appear adequate for activities, safety and security within the school?"},{"$f":"IF(A_4.34=0,\"\",A_4.34)","v":""},{"$f":"IF(D67=\"no\",$L68,\"\")","v":""},"",{"$f":"N_4.34","v":0},null,null,"","P3","Engage an electrical contractor to review and install appropriate lighting where required."]
[null,"NOISE"]
[null,"4.25",{"$f":"Q4.25","v":"Have work areas and equipment been assessed to identify any situations where the employee is exposed to a noisy environment? "},{"$f":"IF(A_4.25=0,\"\",A_4.25)","v":""},{"$f":"IF(D69=\"no\",$L69,\"\")","v":""},{"$f":"IF(D69=\"no\",$K69,\"\")","v":""},{"$f":"N_4.25","v":0},null,null,{"$f":"IF(OR(D69=\"Yes\",D69=\"Not Applicable\"),\"Completed\",\"\")","v":""},"P3","Identify locations where staff may be exposed to a noisy environment."]
[null,"4.26",{"$f":"Q4.26","v":"Have identified noise risks (e.g. working with noisy equipment and working in a noisy environment) been recorded in a risk register?  (e.g. MyHR WHS Hazard Report or other register)"},{"$f":"IF(A_4.26=0,\"\",A_4.26)","v":""},"","",{"$f":"N_4.26","v":0},null,null,{"$f":"IF(OR(D70=\"Yes\",D70=\"Not Applicable\"),\"Completed\",\"\")","v":""},"P2","Record hazardous noise risks in the MyHR WHS Risk Register."]
[null,"4.27",{"$f":"Q4.27","v":"Is noise considered when administrative scheduling and allocating work areas is undertaken? "},{"$f":"IF(A_4.27=0,\"\",A_4.27)","v":""},"","",{"$f":"N_4.27","v":0},null,null,"","P2","Consider the areas identified where noise is a risk and how this impacts upon scheduling."]
[null,"4.28",{"$f":"Q4.28","v":"Are employees, students and volunteers provided with Australian Standard approved hearing protection when entering or working in noisy environments?"},{"$f":"IF(A_4.28=0,\"\",A_4.28)","v":""},"","",{"$f":"N_4.28","v":0},null,null,"","P2","Provide appropriate approved hearing protection."]
[null,"4.29",{"$f":"Q4.29","v":"Are signs indicating that personal hearing protection should be worn displayed in a prominent and clear manner?"},{"$f":"IF(A_4.29=0,\"\",A_4.29)","v":""},"","",{"$f":"N_4.29","v":0},null,null,{"$f":"IF(OR(D73=\"Yes\",D73=\"Not Applicable\"),\"Completed\",\"\")","v":""},"P3","Erect appropriate hearing protection signage."]
[null,"4.30",{"$f":"Q4.30","v":"Are required staff participating in the department’s mandatory Hearing Conservation program?"},{"$f":"IF(A_4.30=0,\"\",A_4.30)","v":""},"","",{"$f":"N_4.30","v":0},null,null,{"$f":"IF(OR(D74=\"Yes\",D74=\"Not Applicable\"),\"Completed\",\"\")","v":""},"P4","Register staff for the program and arrange initial testing."]
[null,"OCCUPATIONAL VIOLENCE AND AGGRESSION"]
[null,"4.31",{"$f":"Q4.31","v":"Have all risks (including physical and/or psychological harm, etc.) to staff, students & visitors from Occupational Violence, been assessed, and appropriate controls implemented?"},{"$f":"IF(A_4.31=0,\"\",A_4.31)","v":""},{"$f":"IF(D76=\"no\",$L76,\"\")","v":""},{"$f":"IF(D76=\"no\",$K76,\"\")","v":""},{"$f":"N_4.31","v":0},null,null,{"$f":"IF(OR(D76=\"Yes\",D76=\"Not Applicable\"),\"Completed\",\"\")","v":""},"P2","Risks of occupational violence and aggression have been identified and strategies are being implemented to address these risks."]
["5. Plant Management","5. PLANT MANAGEMENT"]
[null,"5.1",{"$f":"Q5.1","v":"Are the manufacturer's manuals and instructions accessible to staff and applicable to available plant and equipment?"},{"$f":"IF(A_5.1=0,\"\",A_5.1)","v":""},{"$f":"IF(D78=\"no\",$L78,\"\")","v":""},{"$f":"IF(D78=\"no\",$K78,\"\")","v":""},{"$f":"N_5.1","v":0},null,null,"","P3","Make manuals and instructions accessible to employees."]
[null,"5.2",{"$f":"Q5.2","v":"Are written safe work practices available for plant & equipment (e.g. SOPs) accessible and available to staff and students (for example ITD, Agriculture staff and students, schools officers and cleaners)?"},{"$f":"IF(A_5.2=0,\"\",A_5.2)","v":""},"","",{"$f":"N_5.2","v":0},null,null,"","P3","Identify where SOPs are required and need to be made available and rectify."]
[null,"5.3",{"$f":"Q5.3","v":"Are maintenance records kept for plant and machinery?"},{"$f":"IF(A_5.3=0,\"\",A_5.3)","v":""},"","",{"$f":"N_5.3","v":0},null,null,"","P3","Review how maintenance records are kept and introduce / amend as required."]
[null,"5.4",{"$f":"Q5.4","v":"Have all plant and equipment that are portable and attractive items or valued over $500 been recorded on the OneSchool Asset Register?"},{"$f":"IF(A_5.4=0,\"\",A_5.4)","v":""},"","",{"$f":"N_5.4","v":0},null,null,{"$f":"IF(OR(D81=\"Yes\",D81=\"Not Applicable\"),\"Completed\",\"\")","v":""},"P1 ","Record relevant plant and equipment (i.e. portable; attractive; $500+ value) to Asset Register."]
[null,"5.5",{"$f":"Q5.5","v":"Have all lifts, escalators, moving walkways and air compressors (with hazard level -A,B or C) been registered in accordance with Schedule 5 (Part2) of the Work Health and Safety Regulation 2011."},{"$f":"IF(A_5.5=0,\"\",A_5.5)","v":""},"","",{"$f":"N_5.5","v":0},null,null,"","P1","Register lifts, pressure vessels (air compressors), escalators and moving walkways as required."]
[null,"5.6",{"$f":"Q5.6","v":"Is plant and equipment set up appropriately (e.g. secured to benches or floors where required), access is restricted (e.g. locked / key removed) when necessary? \n\n"},{"$f":"IF(A_5.6=0,\"\",A_5.6)","v":""},"","",{"$f":"N_5.6","v":0},null,null,{"$f":"IF(OR(D83=\"Yes\",D83=\"Not Applicable\"),\"Completed\",\"\")","v":""},"P1","Ensure there are systems in place to manage access to plant and equipment.  Ensure plant and equipment is installed and secured appropriately."]
[null,"5.7",{"$f":"Q5.7","v":"Have all persons who are to operate plant and equipment been provided induction, instruction and training where relevant?"},{"$f":"IF(A_5.7=0,\"\",A_5.7)","v":""},"","",{"$f":"N_5.7","v":0},null,null,{"$f":"IF(OR(D84=\"Yes\",D84=\"Not Applicable\"),\"Completed\",\"\")","v":""},"P1","Establish and maintain a record of induction and training for staff (as well as students).  Induction and training records should be task and/or equipment specific."]
[null,"5.8",{"$f":"Q5.8","v":"Has the annual Service Maintenance program for fixed machinery in ITD workshops been completed and all recommendations have been actioned and recorded?"},{"$f":"IF(A_5.8=0,\"\",A_5.8)","v":""},"","",{"$f":"N_5.8","v":0},null,null,"","P2","Review service maintenance reports and action all items for repairs."]
["6. Emergency Management","6. EMERGENCY MANAGEMENT"]
[null,"FIRE SAFETY"]
[null,"6.1",{"$f":"Q6.1","v":"Is the name and contact details of the Fire Safety Advisor (FSA) displayed on the HSW noticeboard?"},{"$f":"IF(A_6.1=0,\"\",A_6.1)","v":""},{"$f":"IF(D88=\"no\",$L88,\"\")","v":""},{"$f":"IF(D88=\"no\",$K88,\"\")","v":""},{"$f":"N_6.1","v":0},null,null,{"$f":"IF(OR(D88=\"Yes\",D88=\"Not Applicable\"),\"Completed\",\"\")","v":""},"P2","Update the Emergency Management Plan to include a qualified Fire Safety Advisor (FSA)."]
[null,"6.2",{"$f":"Q6.2","v":"Is the workplace's Fire and Evacuation Plan (FEP) current (reviewed in last 12 months) and communicated to employees, contractors and visitors with records maintained?"},{"$f":"IF(A_6.2=0,\"\",A_6.2)","v":""},{"$f":"IF(D89=\"no\",$L89,\"\")","v":""},{"$f":"IF(D89=\"no\",$K89,\"\")","v":""},{"$f":"N_6.2","v":0},null,null,{"$f":"IF(OR(D89=\"Yes\",D89=\"Not Applicable\"),\"Completed\",\"\")","v":""},"P2","Update the Emergency Evacuation Plan and communicate as appropriate."]
[null,"6.3",{"$f":"Q6.3","v":"Are evacuation diagrams correct and reflect evacuation routes, assembly points, appliances and manual call points?\n\n"},{"$f":"IF(A_6.3=0,\"\",A_6.3)","v":""},{"$f":"IF(D90=\"no\",$L90,\"\")","v":""},{"$f":"IF(D90=\"no\",$K90,\"\")","v":""},{"$f":"N_6.3","v":0},null,null,{"$f":"IF(OR(D90=\"Yes\",D90=\"Not Applicable\"),\"Completed\",\"\")","v":""},"P2","Identify and correct issues with emergency signs.  Refer to  the Fire Safety Inspection Checklist to guide you through any actions required.  https://education.qld.gov.au/initiativesstrategies/Documents/fire-safety-audit-checklist.docx "]
[null,"6.4",{"$f":"Q6.4","v":"Is the documentation related to fire installation maintenance, staff instructions and emergency exercises retained both on site and at an external location?"},{"$f":"IF(A_6.4=0,\"\",A_6.4)","v":""},{"$f":"IF(D91=\"no\",$L91,\"\")","v":""},{"$f":"IF(D91=\"no\",$K91,\"\")","v":""},{"$f":"N_6.4","v":0},null,null,{"$f":"IF(OR(D91=\"Yes\",D91=\"Not Applicable\"),\"Completed\",\"\")","v":""},"P1","Develop and implement a process for accounting for all persons as part of the Emergency Management Plan (EMP)."]
[null,"EMERGENCY DRILLS"]
[null,"6.5",{"$f":"Q6.5","v":"Schools\nDoes the school conduct an emergency evacuation and a lockdown drill at least once per semester?\n\nOther Workplaces\nDoes the workplace conduct an emergency evacuation at least once per calendar year?"},{"$f":"IF(A_6.5=0,\"\",A_6.5)","v":""},{"$f":"IF(D93=\"no\",$L93,\"\")","v":""},{"$f":"IF(D93=\"no\",$K93,\"\")","v":""},{"$f":"N_6.5","v":0},null,null,{"$f":"IF(OR(D93=\"Yes\",D93=\"Not Applicable\"),\"Completed\",\"\")","v":""},"P1","Implement a schedule for conducting emergency evacuation drills in accordance with Infrastructure Safety Fact Sheet - drills at least every 6mths, best case is each term. Lockdown drills should be at the start of the school year and in the second half of the year."]
[null,"6.6",{"$f":"Q6.6","v":"Are records of drills and emergency responses recorded in the MyHR WHS Emergency Drill module prior to the end of each term in which the drill is conducted?"},{"$f":"IF(A_6.6=0,\"\",A_6.6)","v":""},{"$f":"IF(D94=\"no\",$L94,\"\")","v":""},{"$f":"IF(D94=\"no\",$K94,\"\")","v":""},{"$f":"N_6.6","v":0},null,null,{"$f":"IF(OR(D94=\"Yes\",D94=\"Not Applicable\"),\"Completed\",\"\")","v":""},"P3","Maintain records of drills and emergency responses in the MyHR WHS Emergency Drill module."]
[null,"6.7",{"$f":"Q6.7","v":"Are the results of emergency/lockdown drills reviewed by the workplace management and/or the HSW Committee/School Response Coordinator/School Response Team?"},{"$f":"IF(A_6.7=0,\"\",A_6.7)","v":""},{"$f":"IF(D95=\"no\",$L95,\"\")","v":""},{"$f":"IF(D95=\"no\",$K95,\"\")","v":""},{"$f":"N_6.7","v":0},null,null,{"$f":"IF(OR(D95=\"Yes\",D95=\"Not Applicable\"),\"Completed\",\"\")","v":""},"P2","Implement a process so that results of emergency drills are appropriately reviewed."]
[null,"PERSONNEL"]
[null,"6.8",{"$f":"Q6.8","v":"Is there a nominated and trained Chief Fire Warden and Fire Warden in the workplace (e.g. school)?  "},{"$f":"IF(A_6.8=0,\"\",A_6.8)","v":""},{"$f":"IF(D97=\"no\",$L97,\"\")","v":""},{"$f":"IF(D97=\"no\",$K97,\"\")","v":""},{"$f":"N_6.8","v":0},null,null,{"$f":"IF(OR(D97=\"Yes\",D97=\"Not Applicable\"),\"Completed\",\"\")","v":""},"P2","Appoint wardens. Contact your regional infrastructure advisor for further information."]
[null,"6.9",{"$f":"Q6.9","v":"Is the Fire Team list displayed in a prominent position? "},{"$f":"IF(A_6.9=0,\"\",A_6.9)","v":""},"","",{"$f":"N_6.9","v":0},null,null,"","P2","Display the list of names for the Fire Team in a prominent position. Contact your regional Infrastructure Advisor for further information."]
[null,"6.10",{"$f":"Q6.10","v":"Is the School Response Team (SRT) list displayed in a prominent position?"},{"$f":"IF(A_6.10=0,\"\",A_6.10)","v":""},"","",{"$f":"N_6.10","v":0},null,null,"","P1","Display the list of names for the School Response Team in a prominent position."]
[null,"6.11",{"$f":"Q6.11","v":"Have all staff (regardless of start date) completed annual emergency procedures training, with records of training readily available?"},{"$f":"IF(A_6.11=0,\"\",A_6.11)","v":""},"","",{"$f":"N_6.11","v":0},null,null,"","P1","Identify and arrange instruction accordingly. Annually for all staff, and upon commencement for all new staff (as part of OneInduction). "]
[null,"6.12",{"$f":"Q6.12","v":"Have those with fire evacuation coordination responsibilities (Chief Fire Warden and Fire Wardens) received site specific instruction for these roles?"},{"$f":"IF(A_6.12=0,\"\",A_6.12)","v":""},"","",{"$f":"N_6.12","v":0},null,null,"","P2","Identify and arrange instruction accordingly. Maintain records of training.  Contact your regional Infrastructure Advisor for further information."]
[null,"6.13",{"$f":"Q6.13","v":"Have all School Response Team (SRT) / Regional Response Team members been trained in their roles and responsibilities? Please see Disaster and emergency management arrangements for more information."},{"$f":"IF(A_6.13=0,\"\",A_6.13)","v":""},"","",{"$f":"N_6.13","v":0},null,null,"","P2","Identify and arrange training accordingly.  The approach to emergency mgt is outlined in the Disaster and Emergency mgt arrangements."]
[null,"FIRE FIGHTING APPLIANCES"]
[null,"6.14",{"$f":"Q6.14","v":"Have fire protection systems been serviced at 6 and 12 monthly intervals as part of the service maintenance program and confirm actions have been closed out?  This includes: fire fighting equipment and manual call points/smoke alarms/detectors."},{"$f":"IF(A_6.14=0,\"\",A_6.14)","v":""},{"$f":"IF(D104=\"no\",$L104,\"\")","v":""},{"$f":"IF(D104=\"no\",$K104,\"\")","v":""},{"$f":"N_6.14","v":0},null,null,{"$f":"IF(OR(D104=\"Yes\",D104=\"Not Applicable\"),\"Completed\",\"\")","v":""},"P2","Contact your regional Infrastructure Advisor for advice and further information.  Checking maintenance tags can be conducted as part of the Fire Safety Inspection checklist or by visual inspection of tags, follow up with QBuild for scheduling of fire protection equipment servicing by a specialist contractor."]
[null,"6.15",{"$f":"Q6.15","v":"Are all emergency signs legible and in good condition? Do they accurately reflect the current floor plan and equipment location? Are all fire exits and emergency equipment kept clear from obstruction?"},{"$f":"IF(A_6.15=0,\"\",A_6.15)","v":""},{"$f":"IF(D105=\"no\",$L105,\"\")","v":""},{"$f":"IF(D105=\"no\",$K105,\"\")","v":""},{"$f":"N_6.15","v":0},null,null,"","P1","Contact your regional Infrastructure Advisor  for advice and further information. "]
["7. Employee Wellbeing","7. EMPLOYEE WELLBEING"]
[null,"7.1",{"$f":"Q7.1","v":"Is there evidence to support that the leadership team have communicated their commitment (within the current calendar year) to improving and supporting staff wellbeing?"},{"$f":"IF(A_7.1=0,\"\",A_7.1)","v":""},{"$f":"IF(D107=\"no\",$L107,\"\")","v":""},{"$f":"IF(D107=\"no\",$K107,\"\")","v":""},{"$f":"N_7.1","v":0},null,null,"","P4","Develop a wellbeing commitment statement, include staff wellbeing as a key improvement agenda item within the school/workplace strategic plan, and ensure regular wellbeing communications are disseminated to staff. "]
[null,"7.2",{"$f":"Q7.2","v":"Is staff wellbeing managed as a standing agenda item on the HSW Committee, or through a dedicated wellbeing committee/working group as a subset of the HSW Committee?"},{"$f":"IF(A_7.2=0,\"\",A_7.2)","v":""},"","",{"$f":"N_7.2","v":0},null,null,"","P4","Ensure wellbeing is a standing agenda item on the HSW Committee, and/or establish a dedicated staff wellbeing committee/working group."]
[null,"7.3",{"$f":"Q7.3","v":"Has an annual needs assessment been conducted to inform a staff wellbeing action plan?"},{"$f":"IF(A_7.3=0,\"\",A_7.3)","v":""},"","",{"$f":"N_7.3","v":0},null,null,"","P4","Select a suitable wellbeing needs assessment option for your school/workplace, and encourage participation from all staff. "]
[null,"7.4",{"$f":"Q7.4","v":"Is an annual staff wellbeing action plan developed to implement and review wellbeing initiatives, and communicated at the Wellbeing and/or HSW committees?"},{"$f":"IF(A_7.4=0,\"\",A_7.4)","v":""},"","",{"$f":"N_7.4","v":0},null,null,"","P4","Develop a staff wellbeing action plan based on the findings of your needs assessment. "]
[null,"7.5",{"$f":"Q7.5","v":"Is the staff wellbeing action plan monitored and reviewed to inform future plans?"},{"$f":"IF(A_7.5=0,\"\",A_7.5)","v":""},"","",{"$f":"N_7.5","v":0},null,null,"","P4","Monitor and review your staff wellbeing action plan through your committee or working group to ensure it is meeting the needs of staff. "]
[null,"7.6",{"$f":"Q7.6","v":"Is the Employee Assistance program promoted to all staff, including promotion of the Manager’s Hotline to supervisors and managers?"},{"$f":"IF(A_7.6=0,\"\",A_7.6)","v":""},"","",{"$f":"N_7.6","v":0},null,null,"","P2","Promote the Employee Assistance Program to all staff, including promotion of the Manager Hotline to staff with supervisory responsibilities. "]
["8. Contractor","8. CONTRACTOR MANAGEMENT"]
[null,"8.1",{"$f":"Q8.1","v":"Has the school or workplace established an approved contractors (also known as service providers) list?"},{"$f":"IF(A_8.1=0,\"\",A_8.1)","v":""},{"$f":"IF(D114=\"no\",$L114,\"\")","v":""},{"$f":"IF(D114=\"no\",$K114,\"\")","v":""},{"$f":"N_8.1","v":0},null,null,"","P2","Contact your regional Infrastructure Advisor for more information."]
[null,"8.2",{"$f":"Q8.2","v":"Is there a process for volunteers, visitors and contractors to be locally HSW inducted prior to working, with records of training maintained and readily accessible? "},{"$f":"IF(A_8.2=0,\"\",A_8.2)","v":""},"","",{"$f":"N_8.2","v":0},null,null,"","P2","Contact your regional Infrastructure Advisor for more information."]
[null,"8.3",{"$f":"Q8.3","v":"Is there a process for signing in all service providers, that can be evidenced as being communicated to all staff?"},{"$f":"IF(A_8.3=0,\"\",A_8.3)","v":""},"","",{"$f":"N_8.3","v":0},null,null,"","P2","Contact your regional Infrastructure Advisor for more information."]
[null,"8.4",{"$f":"Q8.4","v":"Does the school ensure Work Area Access Permits (WAAPs) are created for all maintenance, installation, refurbishment and construction related works of any description?"},{"$f":"IF(A_8.4=0,\"\",A_8.4)","v":""},"","",{"$f":"N_8.4","v":0},null,null,"","P2","Contact your regional Infrastructure Advisor for more information."]
[null,"8.5",{"$f":"Q8.5","v":"Are WAAPs electronically closed in the Built Environment Materials Information Register (BEMIR) after the work has been completed and the physical copy of WAAP signed in accordance with the WAAP procedure.  "},{"$f":"IF(A_8.5=0,\"\",A_8.5)","v":""},"","",{"$f":"N_8.5","v":0},null,null,"","P2","All completed WAAPs to be signed by both the service provider and the OIC at completion of works.  Scan a copy into BEMIR and close out WAAPs electronically.  File the original copy of the signed and closed out WAAP on site."]
[null,"8.6",{"$f":"Q8.6","v":"Are arrangements in place for monitoring service providers to ensure they do not pose a risk to staff or students, i.e. has a risk assessment been undertaken in consultation with key stakeholders prior to the activity being undertaken?"},{"$f":"IF(A_8.6=0,\"\",A_8.6)","v":""},"","",{"$f":"N_8.6","v":0},null,null,"","P2","Contact your regional Infrastructure Advisor for more information."]
[null,"8.7",{"$f":"Q8.7","v":"Is there a non-conformance process in place for service providers, that has been communicated (and agreed) to by service providers prior to engagement of work?"},{"$f":"IF(A_8.7=0,\"\",A_8.7)","v":""},"","",{"$f":"N_8.7","v":0},null,null,{"$f":"IF(OR(D120=\"Yes\",D120=\"Not Applicable\"),\"Completed\",\"\")","v":""},"P3","Contact your regional Infrastructure Advisor for more information."]
[null,"8.8",{"$f":"Q8.8","v":"Can it be evidenced that the Officer in Charge has retained any asbestos-related enforcement notices issued to service providers?"},{"$f":"IF(A_8.8=0,\"\",A_8.8)","v":""},"","",{"$f":"N_8.8","v":0},null,null,{"$f":"IF(OR(D121=\"Yes\",D121=\"Not Applicable\"),\"Completed\",\"\")","v":""},"P3","Contact contractor and request copies of the enforcement notice for filing with contract documentation."]
["9. Employee Injury & Claims Management","9. EMPLOYEE INJURY & CLAIMS MANAGEMENT"]
[null,"9.1",{"$f":"Q9.1","v":"Does the school or workplace have a staff member who has completed the Department's online Rehabilitation and Return to Work Coordinator (RRTWC) course? \n(if Yes, please ensure correct name/s are updated to MyHR WHS location page)."},{"$f":"IF(A_9.1=0,\"\",A_9.1)","v":""},{"$f":"IF(D123=\"no\",$L123,\"\")","v":""},{"$f":"IF(D123=\"no\",$K123,\"\")","v":""},{"$f":"N_9.1","v":0},null,null,"","P3","Appoint an appropriately qualified RRTWC.  Successful completion of the Department's RRTWC Online Course located on Education Futures Institute meets this requirement."]
[null,"9.2",{"$f":"Q9.2","v":"If you have ill/injured staff, can the school evidence that staff have been reminded annually of their rights and responsibilities in relation to the lodgement of claims, leave entitlements, and their role in the rehabilitation process?"},{"$f":"IF(A_9.2=0,\"\",A_9.2)","v":""},"","",{"$f":"N_9.2","v":0},null,null,"","P4","Add RRTW to the HSW Committee standing agenda.\nRemind staff at the start of each calendar year and at the commencement of each term of the department's Workplace Rehabilitation procedure and who the RRTWC is for their school/workplace."]
[null,"9.3",{"$f":"Q9.3","v":"If you have ill/injured staff, can the school evidence that injured/ill employees contacted immediately by the RRTWC and/or supervisor to discuss rehabilitation and return to work including suitable duties for work related injury?"},{"$f":"IF(A_9.3=0,\"\",A_9.3)","v":""},"","",{"$f":"N_9.3","v":0},null,null,"","P1","Consider how staff are educated about RRTWC, send communications as appropriate and consider adding information to staff handbooks as required. Display posters with the name and contact details of your school / workplace RRTWC/s."]
[null,"9.4",{"$f":"Q9.4","v":"If you have ill/injured staff, can Principals, Officers-In-Charge or Supervisors evidence actively communicating with the RRTWC and injured/ill employee? "},{"$f":"IF(A_9.4=0,\"\",A_9.4)","v":""},"","",{"$f":"N_9.4","v":0},null,null,"","P3","Identify reasons or barriers why RRTWC do not have the opportunity of early intervention or early engagement with injured workers and identify actions to remedy."]
[null,"9.5",{"$f":"Q9.5","v":"If you have ill/injured staff, can the RRTWC evidence actively engaging with the employee, Principal,  Officer-In-Charge or Supervisor, WorkCover Queensland, and treating medical practitioners to identify suitable duties and enable early return to work?"},{"$f":"IF(A_9.5=0,\"\",A_9.5)","v":""},"","",{"$f":"N_9.5","v":0},null,null,"","P3","Implement and regularly review local processes to ensure the RRTWC is provided adequate time and resources to perform the inherent requirements of the role as a RRTWC."]
[null,"9.6",{"$f":"Q9.6","v":"If you have ill/injured staff, can the school evidence that claim and rehabilitation information/paperwork is being kept on the Injury Management System and where there may be hard copies, they are kept secure and confidential?"},{"$f":"IF(A_9.6=0,\"\",A_9.6)","v":""},"","",{"$f":"N_9.6","v":0},null,null,"",null,"Annually review how records are currently kept and save all claim and rehabilitation records into the secure Injury Management module in the MyHR WHS system."]
["10. Incident Response & Management","10. INCIDENT RESPONSE & MANAGEMENT"]
[null,"FIRST AID"]
[null,"10.1",{"$f":"Q10.1","v":"Are there an appropriate number of trained first aiders in accordance with the \"Managing first aid in the workplace\" procedure?"},{"$f":"IF(A_10.1=0,\"\",A_10.1)","v":""},{"$f":"IF(D131=\"no\",$L131,\"\")","v":""},{"$f":"IF(D131=\"no\",$K131,\"\")","v":""},{"$f":"N_10.1","v":0},null,null,{"$f":"IF(OR(D131=\"Yes\",D131=\"Not Applicable\"),\"Completed\",\"\")","v":""},"P2","Identify the number of first aiders required, ensure you consider health management plans in place when nominating people to those positions and ensure training occurs. Ensuring that records are maintained on file, and the refreshers are undertaken in a timely manner."]
[null,"10.2",{"$f":"Q10.2","v":"Has a first aid risk assessment been completed for the site to ensure appropriate first aid facilities in place? "},{"$f":"IF(A_10.2=0,\"\",A_10.2)","v":""},{"$f":"IF(D132=\"no\",$L132,\"\")","v":""},{"$f":"IF(D132=\"no\",$K132,\"\")","v":""},{"$f":"N_10.2","v":0},null,null,{"$f":"IF(OR(D132=\"Yes\",D132=\"Not Applicable\"),\"Completed\",\"\")","v":""},"P2","Complete the First Aid risk assessment at the commencement of Term 1 (add to planning calendar) to ensure that identification of any changes/needs are incorporated Identify what changes are required to first aid facilities and implement."]
[null,"10.3",{"$f":"Q10.3","v":"Is there a documented regime in place that ensures that the contents of first aid kits, and the status of first aid equipment, is checked and addressed at specified intervals?"},{"$f":"IF(A_10.3=0,\"\",A_10.3)","v":""},{"$f":"IF(D133=\"no\",$L133,\"\")","v":""},{"$f":"IF(D133=\"no\",$K133,\"\")","v":""},{"$f":"N_10.3","v":0},null,null,{"$f":"IF(OR(D133=\"Yes\",D133=\"Not Applicable\"),\"Completed\",\"\")","v":""},"P4","Implement a process to ensure first aid kits are current and restocked at schedules determined."]
[null,"10.4",{"$f":"Q10.4","v":"Is the RRTWC notified of staff injuries presenting for first aid who are identified as needing rehabilitation / early intervention or may be eligible for Workers' Compensation?"},{"$f":"IF(A_10.4=0,\"\",A_10.4)","v":""},{"$f":"IF(D134=\"no\",$L134,\"\")","v":""},{"$f":"IF(D134=\"no\",$K134,\"\")","v":""},{"$f":"N_10.4","v":0},null,null,{"$f":"IF(OR(D134=\"Yes\",D134=\"Not Applicable\"),\"Completed\",\"\")","v":""},"P3","Implement a process connecting the first aid treatment of staff to early intervention and communications with the RRTWC."]
[null,"INCIDENT REPORTING"]
[null,"10.5",{"$f":"Q10.5","v":"Is there evidence that all employees have been provided information on incident reporting, recording and reviewing incidents?"},{"$f":"IF(A_10.5=0,\"\",A_10.5)","v":""},{"$f":"IF(D136=\"no\",$L136,\"\")","v":""},{"$f":"IF(D136=\"no\",$K136,\"\")","v":""},{"$f":"N_10.5","v":0},null,null,{"$f":"IF(OR(D136=\"Yes\",D136=\"Not Applicable\"),\"Completed\",\"\")","v":""},"P2","Review why employee and visitor incidents are not reported in MyHR WHS and take necessary action to remedy."]
[null,"10.6",{"$f":"Q10.6","v":"Is there evidence that relevant employees have been instructed on what is a notifiable incident and when and how to notify WHSQ?"},{"$f":"IF(A_10.6=0,\"\",A_10.6)","v":""},{"$f":"IF(D137=\"no\",$L137,\"\")","v":""},{"$f":"IF(D137=\"no\",$K137,\"\")","v":""},{"$f":"N_10.6","v":0},null,null,{"$f":"IF(OR(D137=\"Yes\",D137=\"Not Applicable\"),\"Completed\",\"\")","v":""},"P2","Identify the delegated person, provide links to reference material (Procedure and OnePortal) and instruction on notifiable incidents and how to report."]
[null,"10.7",{"$f":"Q10.7","v":"Are health and safety incidents investigated in accordance with the HSW Incident Management Procedure?"},{"$f":"IF(A_10.7=0,\"\",A_10.7)","v":""},{"$f":"IF(D138=\"no\",$L138,\"\")","v":""},{"$f":"IF(D138=\"no\",$K138,\"\")","v":""},{"$f":"N_10.7","v":0},null,null,{"$f":"IF(OR(D138=\"Yes\",D138=\"Not Applicable\"),\"Completed\",\"\")","v":""},"P1","Review Procedure and guideline material. Contact your Regional HSW team for advice."]
[null,"10.8",{"$f":"Q10.8","v":"Are incidents in MyHR WHS reviewed in accordance with the Incident Management procedure?"},{"$f":"IF(A_10.8=0,\"\",A_10.8)","v":""},{"$f":"IF(D139=\"no\",$L139,\"\")","v":""},{"$f":"IF(D139=\"no\",$K139,\"\")","v":""},{"$f":"N_10.8","v":0},null,null,{"$f":"IF(OR(D139=\"Yes\",D139=\"Not Applicable\"),\"Completed\",\"\")","v":""},"P4","Check incidents recorded in the MyHR WHS system to monitor review status."]
[null,"ASBESTOS-RELATED INCIDENTS"]
[null,"10.9",{"$f":"Q10.9","v":"Is there a system in place to ensure that asbestos-related incidents are recorded in BEMIR as per the Asbestos Management Procedure?"},{"$f":"IF(A_10.9=0,\"\",A_10.9)","v":""},{"$f":"IF(D141=\"no\",$L141,\"\")","v":""},{"$f":"IF(D141=\"no\",$K141,\"\")","v":""},null,null,null,null,"P1","Allocate responsibilities (OIC delegations) for BEMIR reporting and review training and asbestos management procedure to confirm responsibilities and timelines."]
[null,"10.10",{"$f":"Q10.10","v":"Can it be evidenced that asbestos-related incidents are recorded in MyHR WHS if the incident:\na) is determined to be an asbestos dangerous incident, or \nb) has led to a person to reach a belief that a member of the facility community has been exposed to airborne asbestos because of the incident. "},{"$f":"IF(A_10.10=0,\"\",A_10.10)","v":""},{"$f":"IF(D142=\"no\",$L142,\"\")","v":""},{"$f":"IF(D142=\"no\",$K142,\"\")","v":""},null,null,null,null,"P1","Identify all asbestos-related incidents,  review against the asbestos management procedure for eligibility to enter into MyHR WHS.  Document the outcome / review, this may be completed within BEMIR reporting or on a separate document as deemed appropriate for the facility."]
[null,"10.11",{"$f":"Q10.11","v":"Can it be evidenced that asbestos-related incidents are investigated in accordance with the Asbestos incident management procedure?"},{"$f":"IF(A_10.11=0,\"\",A_10.11)","v":""},{"$f":"IF(D143=\"no\",$L143,\"\")","v":""},{"$f":"IF(D143=\"no\",$K143,\"\")","v":""},null,null,null,null,"P3","All incidents are investigated, reviewed and actions closed out with evidence of completion attached."]
[null,"10.12",{"$f":"Q10.12","v":"Can it be evidenced that corrective and preventative actions arising from asbestos-related incidents have been implemented?"},{"$f":"IF(A_10.12=0,\"\",A_10.12)","v":""},{"$f":"IF(D144=\"no\",$L144,\"\")","v":""},{"$f":"IF(D144=\"no\",$K144,\"\")","v":""},null,null,null,null,"P3","Review all actions and confirm implementation, attach evidence (photos, invoices, work orders etc.) to the investigation."]
[null,"10.13",{"$f":"Q10.13","v":"Can it be evidenced that parents/carers have been notified of student proximity incidents arising from asbestos-related incidents?"},{"$f":"IF(A_10.13=0,\"\",A_10.13)","v":""},{"$f":"IF(D145=\"no\",$L145,\"\")","v":""},{"$f":"IF(D145=\"no\",$K145,\"\")","v":""},null,null,null,null,"P1","Attach a copy of the issued letter with the email to the investigation report."]
["11. Review & Improvement","11. REVIEW & IMPROVEMENT"]
[null,"11.1",{"$f":"Q11.1","v":"Are there procedures or processes in place for regularly monitoring and measuring the workplace activities in relation to HSW?"},{"$f":"IF(A_11.1=0,\"\",A_11.1)","v":""},{"$f":"IF(D147=\"no\",$L147,\"\")","v":""},{"$f":"IF(D147=\"no\",$K147,\"\")","v":""},{"$f":"N_11.1","v":0},null,null,{"$f":"IF(OR(D147=\"Yes\",D147=\"Not Applicable\"),\"Completed\",\"\")","v":""},"P2","Implement processes to ensure regular monitoring and measuring occurs. (Inspection / training schedules or calendars with allocated responsibilities)"]
[null,"11.6",{"$f":"Q11.6","v":"Can it be evidenced that the Officer in Charge has carried out an annual review of the effectiveness of the facility specific asbestos management related procedures, processes and systems."},{"$f":"IF(A_11.6=0,\"\",A_11.6)","v":""},{"$f":"IF(D148=\"no\",$L148,\"\")","v":""},{"$f":"IF(D148=\"no\",$K148,\"\")","v":""},{"$f":"N_11.6","v":0},null,null,{"$f":"IF(OR(D148=\"Yes\",D148=\"Not Applicable\"),\"Completed\",\"\")","v":""},"P2","Review the site specific asbestos management plan and the application of over the previous 12 months including all asbestos related incidents and recommendations. Provide feedback to infrastructure safety (as relevant) and file on site the most recently expired site-specific asbestos management plan."]
[null,"LAST YEARS ASA"]
[null,"11.3",{"$f":"Q11.3","v":"Is a copy of the completed ASA stored and accessible onsite AND uploaded into MyHR WHS under the Committee Module?"},{"$f":"IF(A_11.3=0,\"\",A_11.3)","v":""},{"$f":"IF(D150=\"no\",$L150,\"\")","v":""},{"$f":"IF(D150=\"no\",$K150,\"\")","v":""},{"$f":"N_11.3","v":0},null,null,{"$f":"IF(OR(D150=\"Yes\",D150=\"Not Applicable\"),\"Completed\",\"\")","v":""},"P1","Submit a copy of this year's and last year's ASA including action plans."]
[null,"11.4",{"$f":"Q11.4","v":"Was the ASA action plan for last year completed and/or items have been carried over to this year?"},{"$f":"IF(A_11.4=0,\"\",A_11.4)","v":""},{"$f":"IF(D151=\"no\",$L151,\"\")","v":""},{"$f":"IF(D151=\"no\",$K151,\"\")","v":""},{"$f":"N_11.4","v":0},null,null,"","P3","Identify why last year's ASA action plan was not completed or not integrated into action planning for this year, note reasons at the HSW committee meeting and put plans in place to add future actions onto the HSW Planning Calendar."]
[null,"11.5",{"$f":"Q11.5","v":"Is the ASA action plan reviewed at least each term by the HSW Committee until all actions have been completed?"},{"$f":"IF(A_11.5=0,\"\",A_11.5)","v":""},{"$f":"IF(D152=\"no\",$L152,\"\")","v":""},{"$f":"IF(D152=\"no\",$K152,\"\")","v":""},{"$f":"N_11.5","v":0},null,null,{"$f":"IF(OR(D152=\"Yes\",D152=\"Not Applicable\"),\"Completed\",\"\")","v":""},"P3","Add the ASA action plan to the HSW Committee standing agenda, include progression of Action Plan as an attachment to the meeting minutes, and address updates completed since last meetings, and proposed actions schedule for completion."]
["12. Leadership & Governance","12. LEADERSHIP & GOVERNANCE"]
[null,"12.1",{"$f":"Q12.1","v":"Does the workplace (e.g. school) have a current staff wellbeing action plan based on findings of an annual needs assessment which is reviewed regularly?"},{"$f":"IF(A_12.1=0,\"\",A_12.1)","v":""},{"$f":"IF(D154=\"no\",$L154,\"\")","v":""},{"$f":"IF(D154=\"no\",$K154,\"\")","v":""},{"$f":"N_12.1","v":0},null,null,"","P3","Develop a staff wellbeing action plan based on the findings of a suitable needs assessment. Monitor and review your action plan through a HSW Committee or working group to ensure it is meeting the needs of staff."]
[null,"12.2",{"$f":"Q12.2","v":"Can you evidence how you made staff aware of HSW objectives, their accountabilities and commitment to work health and safety (WHS) through induction and then ongoing within the workplace?"},{"$f":"IF(A_12.2=0,\"\",A_12.2)","v":""},"","",{"$f":"N_12.2","v":0},null,null,"","P3","Identify and implement actions that can be undertaken throughout the year to communicate to staff on HSW."]
[null,"12.3",{"$f":"Q12.3","v":"Are staff with health, safety & wellbeing roles/responsibilities allocated sufficient time and resources to complete their tasks? e.g. HSA, HSR, RRTWC, Incident Investigator  \nPlease visit Managing Health and Safety for more information."},{"$f":"IF(A_12.3=0,\"\",A_12.3)","v":""},"","",{"$f":"N_12.3","v":0},null,null,"","P2","Identify the needs of the HSA and RRTWC in terms of time and resourcing and implement action to remedy any deficiencies."]
[null,"12.4",{"$f":"Q12.4","v":"Is the MyHR WHS Location page checked each term and updated accordingly by the OIC or DOIC?\n\nSet up your Location Screen quick reference."},{"$f":"IF(A_12.4=0,\"\",A_12.4)","v":""},"","",{"$f":"N_12.4","v":0},null,null,"","P3","Implement a process so the MyHR WHS Location page is checked each term and updated accordingly.  E.g. use the HSW Planning Calendar to update Location page at beginning of each term."]
[null,"12.5",{"$f":"Q12.5","v":"Do you play an active role in HSW at work? \n* Chairing HSW Committee\n* Providing adequate resourcing for HSW issues"},{"$f":"IF(A_12.5=0,\"\",A_12.5)","v":""},"","",{"$f":"N_12.5","v":0},null,null,"","P3","Identify the actions required and implement for the officer in charge to play an active role in HSW at work.  Consider how these actions will be reviewed in next years ASA."]
[null,"12.6",{"$f":"Q12.6","v":"Are there established and effective mechanisms for consultation with all staff about changes that may affect their health, safety and wellbeing such as changes to work location or roles, major works, new equipment, processes, policies or hazardous substances? "},{"$f":"IF(A_12.6=0,\"\",A_12.6)","v":""},"","",{"$f":"N_12.6","v":0},null,null,"","P1","Identify the mechanisms in which staff can be consulted regarding change in the workplace and ensure use of those mechanisms."]
[null,"12.7",{"$f":"Q12.7","v":"Is incident data, including incidents impacting psychological health and incidents involving occupational violence, regularly monitored by the workplace leadership to identify trends and ensure appropriate control measures have been implemented?"},{"$f":"IF(A_12.7=0,\"\",A_12.7)","v":""},"","",{"$f":"N_12.7","v":0},null,null,"","P2","Workplace leadership to regularly review incident data (including at HSW committee meetings) to identify trends and ensure appropriate control measures are implemented."]
[null,"12.8",{"$f":"Q12.8","v":"Is a Standard Investigation completed for Class 2 Incidents and Dangerous Incidents (including electrical incidents involving a shock to a person)?  For further information see Incidents and Investigations."},{"$f":"IF(A_12.8=0,\"\",A_12.8)","v":""},"","",{"$f":"N_12.8","v":0},null,null,"","P3","Have a process in place for addressing why investigations haven't been occurring and a review plan in place to monitor corrective actions."]
[null,"12.9",{"$f":"Q12.9","v":"Is there a trained Health and Safety Investigator at your school? For training, please see Health & Safety Investigator Training on QLearn"},{"$f":"IF(A_12.9=0,\"\",A_12.9)","v":""},"","",{"$f":"N_12.9","v":0},null,null,"","P4","Identify an Investigator, ensure training takes place and appropriate supports are implemented for Investigator to take on the duty."]
[null,"12.10",{"$f":"Q12.10","v":"Does the workplace (e.g. school) have a current Safety Action Plan based on findings of the Annual Safety Assessment which is reviewed regularly? (Refer to 11.5)"},{"$f":"IF(A_12.10=0,\"\",A_12.10)","v":""},"","",{"$f":"N_12.10","v":0},null,null,{"$f":"IF(OR(D163=\"Yes\",D163=\"Not Applicable\"),\"Completed\",\"\")","v":""},"P4","Determine if there is an action plan for last year and if so, introduce that as a standing agenda item to the HSW committee."]
[null,"12.11",{"$f":"Q12.11","v":"Is an annual HSW Planning Calendar prepared at the beginning of each year incorporating proposed dates for:\n* Quarterly HSW Committee meetings including review of CMP (Refer 1.3 and 4.1)\n* Quarterly Workplace Inspection Schedule\n* Anaphylaxis risk management plan\n* Annual Review of MyHR WHS Risk Register (Refer 3.4)\n* Quarterly Emergency Drills (Refer 6.5)\n* Annual Safety Assessment (Refer 11.2)\n* Annual Chemical Stocktake\n* Annual Review of the HSW Training Register\n* Annual First Aid Risk Assessment\n\nHealth, Safety and Wellbeing - School Calendar of Activities and Events"},{"$f":"IF(A_12.11=0,\"\",A_12.11)","v":""},"","",{"$f":"N_12.11","v":0},null,null,{"$f":"IF(OR(D164=\"Yes\",D164=\"Not Applicable\"),\"Completed\",\"\")","v":""},"P4","Have a process for preparing an annual HSW Planning Calendar for each year."]
[null,"12.12",{"$f":"Q12.12","v":"Has the annual occupier statement been forwarded to QFES? \n\n• Occupier Statements are sent by QBuild to school Principals via the generic Principal email address. The statements are to be checked, signed  and forwarded to QFES by the due date.\n\n• Schools are to print out and retain a hard copy of the signed occupier statement. The signed copy should be emailed to QFES: occupier.statements@qfes.qld.gov.au\n\n• Schools are to keep an electronic file of the occupier statement on the server. This will conform to the Building Fire Safety regulation requirement to have a copy on site and a copy offsite.   \n\n• For further information contact:  QBuildSEQACR@epw.qld.gov.au"},{"$f":"IF(A_12.12=0,\"\",A_12.12)","v":""},"","",{"$f":"N_12.12","v":0},null,null,{"$f":"IF(OR(D165=\"Yes\",D165=\"Not Applicable\"),\"Completed\",\"\")","v":""},"P1","Send the occupier statement to QFES: occupier.statements@qfes.qld.gov.au"]
[null,"12.13",{"$f":"Q12.13","v":"Can it be evidenced that copies of asbestos-related enforcement notices are supplied to nominated people?\n\nThe OIC must ensure a copy of an asbestos-related enforcement notice issued to the department, is immediately supplied to:\n* the relevant Regional Director(schools and regional offices)\n* the relevant Regional Infrastructure Manager (schools and regional offices)\n* Director, Infrastructure Safety\n* Director, Organisational Safety and Wellbeing"},{"$f":"IF(A_12.13=0,\"\",A_12.13)","v":""},"","",{"$f":"N_12.13","v":0},null,null,{"$f":"IF(OR(D166=\"Yes\",D166=\"Not Applicable\"),\"Completed\",\"\")","v":""},"P3","Contact contractor to obtain a copy of any known enforcement notices (asbestos-work related) and forward a copy to the Regional Director, Regional Infrastructure Advisor, Director Infrastructure Safety and the Director Organisational Safety and Wellbeing."]
["Other (Free Text Section)","FREE TEXT SECTION - ADD YOUR OWN NOTES"]
[null,"N/A",null,null,null,null,null,null,null,{"$f":"IF(OR(D168=\"Yes\",D168=\"Not Applicable\"),\"Completed\",\"\")","v":""}]
[null,"N/A",null,null,null,null,null,null,null,{"$f":"IF(OR(D169=\"Yes\",D169=\"Not Applicable\"),\"Completed\",\"\")","v":""}]
[null,"N/A",null,null,null,null,null,null,null,{"$f":"IF(OR(D170=\"Yes\",D170=\"Not Applicable\"),\"Completed\",\"\")","v":""}]
[null,"N/A",null,null,null,null,null,null,null,{"$f":"IF(OR(D171=\"Yes\",D171=\"Not Applicable\"),\"Completed\",\"\")","v":""}]
[null,"N/A",null,null,null,null,null,null,null,{"$f":"IF(OR(D172=\"Yes\",D172=\"Not Applicable\"),\"Completed\",\"\")","v":""}]
[]
[]
[null,null,null,null,null,null,null,null,null,null,{"$f":"COUNTIF(K5:K166,\"<>\"&\"\")","v":132}]

{"sheet":"Access Import","index":16,"n_rows":2,"n_cols":155,"rows_kept":2,"cut":false,"hidden":true,"merged":[]}
["Region","Loc","Workplace_Name","Assessment Compiled By","Officer in Charge","ASA Received","Assessment_Date","QTR","Year ASA Completed","1.Communication & Consultation","2.HSW Capability","3.Risk Management","4.Specific Risks","5.Plant Management","6.Emergency Management","7.Employee Wellbeing","8.Contractor Management","9.Injury & Claims Management ","10.Incident Management","11.Review & Improvement","12.Leadership & Governance","Overall Score","1.1",1.2,1.3,1.4,1.5,1.6,1.7,1.8,1.9,2.1,2.2000000000000002,2.2999999999999998,2.4,"2.5","2.6","3.1","3.2",3.3,3.4,3.5,3.6,3.7,"3.8","3.9","3.10","4.1","4.2","4.3","4.4","4.5","4.6","4.7","4.8","4.9","4.10","4.11","4.12","4.13","4.14","4.15","4.16","4.17","4.18","4.19","4.20","4.21","4.22","4.23","4.24","4.25","4.26","4.27","4.28","4.29","4.30","4.31","4.32","4.33","4.34","5.1","5.2","5.3","5.4","5.5","5.6","5.7","5.8","6.1","6.2","6.3","6.4","6.5","6.6","6.7","6.8","6.9","6.10","6.11","6.12","6.13","6.14","6.15","7.1","7.2","7.3","7.4","7.5","7.6","8.1","8.2","8.3","8.4","8.5","8.6","8.7","8.8","9.1","9.2","9.3","9.4","9.5","9.6","10.1","10.2","10.3","10.4","10.5","10.6","10.7","10.8","10.9","10.10","10.11","10.12","10.13","11.1","11.3","11.4","11.5","11.6","12.1","12.2","12.3","12.4","12.5","12.6","12.7","12.8","12.9","12.10","12.11","12.12","12.13"]
[{"$f":"VLOOKUP(Region,Lists!K3:L11,2,FALSE)","v":{"$error":"#N/A"}},{"$f":"VLOOKUP(TRIM(Workplace_Name),CIS_list[],2,FALSE)","v":{"$error":"#N/A"}},{"$f":"Workplace_Name","v":0},{"$f":"Compiled_By","v":0},{"$f":"OIC","v":0},"Yes",{"$f":"Evaluation_Date","v":"00:00:00"},{"$f":"IF(G2<>\"\",(ROUNDUP(MONTH(G2)/3,0)),\"\")","v":1},{"$f":"IF(G2<>\"\",(YEAR(G2)),\"\")","v":1900},{"$f":"Working!L5","v":"N/A"},{"$f":"Working!L6","v":"N/A"},{"$f":"Working!L7","v":"N/A"},{"$f":"Working!L8","v":"N/A"},{"$f":"Working!L9","v":"N/A"},{"$f":"Working!L10","v":"N/A"},{"$f":"Working!L11","v":"N/A"},{"$f":"Working!L12","v":"N/A"},{"$f":"Working!L13","v":"N/A"},{"$f":"Working!L14","v":"N/A"},{"$f":"Working!L15","v":"N/A"},{"$f":"Working!L16","v":"N/A"},{"$f":"Results!$E$19","v":"N/A"},{"$f":"A_1.1","v":0},{"$f":"A_1.2","v":0},{"$f":"A_1.3","v":0},{"$f":"A_1.4","v":0},{"$f":"A_1.5","v":0},{"$f":"A_1.6","v":0},{"$f":"A_1.7","v":0},{"$f":"A_1.8","v":0},{"$f":"A_1.9","v":0},{"$f":"A_2.1","v":0},{"$f":"A_2.2","v":0},{"$f":"A_2.3","v":0},{"$f":"A_2.4","v":0},{"$f":"A_2.5","v":0},{"$f":"A_2.6","v":0},{"$f":"A_3.1","v":0},{"$f":"A_3.2","v":0},{"$f":"A_3.3","v":0},{"$f":"A_3.4","v":0},{"$f":"A_3.5","v":0},{"$f":"A_3.6","v":0},{"$f":"A_3.7","v":0},{"$f":"A_3.8","v":0},{"$f":"A_3.9","v":0},{"$f":"A_3.10","v":0},{"$f":"A_4.1","v":0},{"$f":"A_4.2","v":0},{"$f":"A_4.3","v":0},{"$f":"A_4.4","v":0},{"$f":"A_4.5","v":0},{"$f":"A_4.6","v":0},{"$f":"A_4.7","v":0},{"$f":"A_4.8","v":0},{"$f":"A_4.9","v":0},{"$f":"A_4.10","v":0},{"$f":"A_4.11","v":0},{"$f":"A_4.12","v":0},{"$f":"A_4.13","v":0},{"$f":"A_4.14","v":0},{"$f":"A_4.15","v":0},{"$f":"A_4.16","v":0},{"$f":"A_4.17","v":0},{"$f":"A_4.18","v":0},{"$f":"A_4.19","v":0},{"$f":"A_4.20","v":0},{"$f":"A_4.21","v":0},{"$f":"A_4.22","v":0},{"$f":"A_4.23","v":0},{"$f":"A_4.24","v":0},{"$f":"A_4.25","v":0},{"$f":"A_4.26","v":0},{"$f":"A_4.27","v":0},{"$f":"A_4.28","v":0},{"$f":"A_4.29","v":0},{"$f":"A_4.30","v":0},{"$f":"A_4.31","v":0},{"$f":"A_4.32","v":0},{"$f":"A_4.33","v":0},{"$f":"A_4.34","v":0},{"$f":"A_5.1","v":0},{"$f":"A_5.2","v":0},{"$f":"A_5.3","v":0},{"$f":"A_5.4","v":0},{"$f":"A_5.5","v":0},{"$f":"A_5.6","v":0},{"$f":"A_5.7","v":0},{"$f":"A_5.8","v":0},{"$f":"A_6.1","v":0},{"$f":"A_6.2","v":0},{"$f":"A_6.3","v":0},{"$f":"A_6.4","v":0},{"$f":"A_6.5","v":0},{"$f":"A_6.6","v":0},{"$f":"A_6.7","v":0},{"$f":"A_6.8","v":0},{"$f":"A_6.9","v":0},{"$f":"A_6.10","v":0},{"$f":"A_6.11","v":0},{"$f":"A_6.12","v":0},{"$f":"A_6.13","v":0},{"$f":"A_6.14","v":0},{"$f":"A_6.15","v":0},{"$f":"A_7.1","v":0},{"$f":"A_7.2","v":0},{"$f":"A_7.3","v":0},{"$f":"A_7.4","v":0},{"$f":"A_7.5","v":0},{"$f":"A_7.6","v":0},{"$f":"A_8.1","v":0},{"$f":"A_8.2","v":0},{"$f":"A_8.3","v":0},{"$f":"A_8.4","v":0},{"$f":"A_8.5","v":0},{"$f":"A_8.6","v":0},{"$f":"A_8.7","v":0},{"$f":"A_8.8","v":0},{"$f":"A_9.1","v":0},{"$f":"A_9.2","v":0},{"$f":"A_9.3","v":0},{"$f":"A_9.4","v":0},{"$f":"A_9.5","v":0},{"$f":"A_9.6","v":0},{"$f":"A_10.1","v":0},{"$f":"A_10.2","v":0},{"$f":"A_10.3","v":0},{"$f":"A_10.4","v":0},{"$f":"A_10.5","v":0},{"$f":"A_10.6","v":0},{"$f":"A_10.7","v":0},{"$f":"A_10.8","v":0},{"$f":"A_10.9","v":0},{"$f":"A_10.10","v":0},{"$f":"A_10.11","v":0},{"$f":"A_10.12","v":0},{"$f":"A_10.13","v":0},{"$f":"A_11.1","v":0},{"$f":"A_11.3","v":0},{"$f":"A_11.4","v":0},{"$f":"A_11.5","v":0},{"$f":"A_11.6","v":0},{"$f":"A_12.1","v":0},{"$f":"A_12.2","v":0},{"$f":"A_12.3","v":0},{"$f":"A_12.4","v":0},{"$f":"A_12.5","v":0},{"$f":"A_12.6","v":0},{"$f":"A_12.7","v":0},{"$f":"A_12.8","v":0},{"$f":"A_12.9","v":0},{"$f":"A_12.10","v":0},{"$f":"A_12.11","v":0},{"$f":"A_12.12","v":0},{"$f":"A_12.13","v":0}]

{"sheet":"Working","index":17,"n_rows":137,"n_cols":14,"rows_kept":137,"cut":false,"hidden":true,"merged":[[19,7,19,8],[18,7,18,8],[19,9,19,13],[17,7,17,8]]}
[]
[null,"Questions",null,null,null,null,null,"Sections"]
[]
[null,"Question","Result","Weighting","Question Score","Potential Score",null,"Section","Status","Section Score","Section Possible","Section Percentage","Section Weighting","Weighted Score"]
[null,"1.1",{"$f":"A_1.1","v":0},11.11,{"$f":"IF((OR(C5=\"Yes\",C5=\"Not Applicable\")),D5,0)","v":0},{"$f":"D5","v":11.11},null,"1. Communication & Consultation",{"$f":"'1. Consult'!C6","v":"Not Started - 0 of 9 Questions Answered"},{"$f":"SUM(S1_Score)","v":0},{"$f":"SUM(S1_Possible_Score)","v":100},{"$f":"IF(ISNUMBER(SEARCH(\"Complete\",I5)),J5/K5,\"N/A\")","v":"N/A"},9,{"$f":"M5*L5","v":{"$error":"#VALUE!"}}]
[null,1.2,{"$f":"A_1.2","v":0},11.11,{"$f":"IF((OR(C6=\"Yes\",C6=\"Not Applicable\")),D6,0)","v":0},{"$f":"D6","v":11.11},null,"2. HSW Capability",{"$f":"'2. Capability'!C6","v":"Not Started - 0 of 6 Questions Answered"},{"$f":"SUM(S2_Score)","v":0},{"$f":"SUM(S2_Possible_Score)","v":100.00000000000001},"N/A",9,{"$error":"#VALUE!"}]
[null,1.3,{"$f":"A_1.3","v":0},11.11,0,11.11,null,"3. Risk Management",{"$f":"'3. Risk'!C6","v":"Not Started - 0 of 10 Questions Answered"},{"$f":"SUM(S3_Score)","v":0},{"$f":"SUM(S3_Possible_Score)","v":100},"N/A",9,{"$error":"#VALUE!"}]
[null,1.4,{"$f":"A_1.4","v":0},11.11,0,11.11,null,"4. Specific Risk",{"$f":"'4. Specific Risk'!C6","v":"Not Started - 0 of 34 Questions Answered"},{"$f":"SUM(S4_Score)","v":0},{"$f":"SUM(S4_Possible_Score)","v":99.999999999999929},"N/A",9,{"$error":"#VALUE!"}]
[null,1.5,{"$f":"A_1.5","v":0},11.11,0,11.11,null,"5. Plant Management",{"$f":"'5. Plant Mgt'!C6","v":"Not Started - 0 of 8 Questions Answered"},{"$f":"SUM(S5_Score)","v":0},{"$f":"SUM(S5_Possible_Score)","v":100},"N/A",9,{"$error":"#VALUE!"}]
[null,1.6,{"$f":"A_1.6","v":0},11.11,0,11.11,null,"6. Emergency Management",{"$f":"'6. Emergency Mgt'!C6","v":"Not Started - 0 of 15 Questions Answered"},{"$f":"SUM(S6_Score)","v":0},{"$f":"SUM(S6_Possible_Score)","v":99.999999999999972},"N/A",9,{"$error":"#VALUE!"}]
[null,1.7,{"$f":"A_1.7","v":0},11.11,0,11.11,null,"7. Employee Wellbeing",{"$f":"'7. Employee Wellbeing'!C6","v":"Not Started - 0 of 6 Questions Answered"},{"$f":"SUM(S7_Score)","v":0},{"$f":"SUM(S7_Possible_Score)","v":100},"N/A",9,{"$error":"#VALUE!"}]
[null,1.8,{"$f":"A_1.8","v":0},11.11,0,11.11,null,"8. Contractor & Supplier Management",{"$f":"'8. Contractor'!C6","v":"Not Started - 0 of 8 Questions Answered"},{"$f":"SUM(S8_Score)","v":0},{"$f":"SUM(S8_Possible_Score)","v":100},"N/A",9,{"$error":"#VALUE!"}]
[null,1.9,{"$f":"A_1.9","v":0},11.12,0,11.12,null,"9. Injury & Claims Management",{"$f":"'9. Injury & Claims Mgt'!C6","v":"Not Started - 0 of 6 Questions Answered"},{"$f":"SUM(S9_Score)","v":0},{"$f":"SUM(S9_Possible_Score)","v":100},"N/A",9,{"$error":"#VALUE!"}]
[null,2.1,{"$f":"A_2.1","v":0},16.666666666666668,{"$f":"IF((OR(C14=\"Yes\",C14=\"Not Applicable\")),D14,0)","v":0},16.666666666666668,null,"10. Incident Response & Management",{"$f":"'10. Incident Mgt'!C6","v":"Not Started - 0 of 13 Questions Answered"},{"$f":"SUM(S10_Score)","v":0},{"$f":"SUM(S10_Possible_Score)","v":100},"N/A",9,{"$error":"#VALUE!"}]
[null,2.2000000000000002,{"$f":"A_2.2","v":0},16.666666666666668,{"$f":"IF((OR(C15=\"Yes\",C15=\"Not Applicable\")),D15,0)","v":0},16.666666666666668,null,"11. Review & Improvement",{"$f":"'11. Review'!C6","v":"Not Started - 0 of 5 Questions Answered"},{"$f":"SUM(S11_Score)","v":0},{"$f":"SUM(S11_Possible_Score)","v":100},"N/A",9,{"$error":"#VALUE!"}]
[null,2.2999999999999998,{"$f":"A_2.3","v":0},16.666666666666668,0,16.666666666666668,null,"12. Leadership & Governance",{"$f":"'12. Leadership'!C6","v":"Not Started - 0 of 13 Questions Answered"},{"$f":"SUM(SL_Score)","v":0},{"$f":"SUM(SL_Possible_Score)","v":100},"N/A",1,{"$error":"#VALUE!"}]
[null,2.4,{"$f":"A_2.4","v":0},16.666666666666668,0,16.666666666666668,null,null,null,null,null,{"$f":"IF(COUNTIF(L5:L16,\"N/A\"),1,0)","v":1}]
[null,"2.5",{"$f":"A_2.5","v":0},16.666666666666668,0,16.666666666666668,null,{"$f":"IF(Region=\"\",\"\",Region&\" - \")","v":""},null,"ASA 2024"]
[null,"2.6",{"$f":"A_2.6","v":0},16.666666666666668,0,16.666666666666668,null,{"$f":"IF(Workplace_Name=\"\",\"\",Workplace_Name&\" - \")","v":""},null,{"$f":"J18&\" \"&Workplace_Name","v":"ASA 2024 "}]
[null,"3.1",{"$f":"A_3.1","v":0},10,{"$f":"IF((OR(C20=\"Yes\",C20=\"Not Applicable\")),D20,0)","v":0},{"$f":"D20","v":10},null,{"$f":"IF('Cover Page'!M10=\"\",\"\",TEXT(DATE(YEAR(Evaluation_Date),MONTH(Evaluation_Date),DAY(Evaluation_Date)),\"d mmmm yyyy\"))","v":""},null,{"$f":"H19&H18&H20","v":""}]
[null,"3.2",{"$f":"A_3.2","v":0},10,0,10]
[null,3.3,{"$f":"A_3.3","v":0},10,0,10,null,"Overall Audit Score",{"$f":"SUM(N5:N16)/100","v":{"$error":"#VALUE!"}},"Output"]
[null,3.4,{"$f":"A_3.4","v":0},10,0,10,null,"Overall Grade",{"$f":"IF(I22>=0.95,\"100%≤> 95%\",IF(I22>=0.88,\"95%≤> 88%\",IF(I22>=0.82,\"88%≤> 82%\",IF(I22>=0.76,\"82%≤> 76%\",IF(I22>=0.7,\"76%≤> 70%\",IF(I22>=0.64,\"70%≤> 64%\",IF(I22>=0.58,\"64%≤> 58%\",IF(I22>=0.5,\"58%≤>50%\",IF(I22<=0.5,\"50%≤>0%\",\"\")))))))))","v":{"$error":"#VALUE!"}},{"$f":"IF(COUNTIF(I5:I16,\"*Complete*\")<>9,\"N/A\",I23)","v":"N/A"}]
[null,3.5,{"$f":"A_3.5","v":0},10,0,10,null,"> 95%",0.95]
[null,3.6,{"$f":"A_3.6","v":0},10,0,10,null,"> 88%",0.88]
[null,3.7,{"$f":"A_3.7","v":0},10,0,10,null,"> 82%",0.82]
[null,"3.8",{"$f":"A_3.8","v":0},10,0,10,null,"> 76%",0.76]
[null,"3.9",{"$f":"A_3.9","v":0},10,0,10,null,"> 70%",0.7]
[null,"3.10",{"$f":"A_3.10","v":0},10,0,10,null,"> 64%",0.64]
[null,"4.1",{"$f":"A_4.1","v":0},2.9411764705882355,{"$f":"IF((OR(C30=\"Yes\",C30=\"Not Applicable\")),D30,0)","v":0},2.9411764705882355,null,"> 58%",0.57999999999999996]
[null,"4.2",{"$f":"A_4.2","v":0},2.9411764705882355,0,2.9411764705882355,null,"> 50%",0.5]
[null,"4.3",{"$f":"A_4.3","v":0},2.9411764705882355,0,2.9411764705882355,null,"<50%","<50%"]
[null,"4.4",{"$f":"A_4.4","v":0},2.9411764705882355,0,2.9411764705882355]
[null,"4.5",{"$f":"A_4.5","v":0},2.9411764705882355,0,2.9411764705882355]
[null,"4.6",{"$f":"A_4.6","v":0},2.9411764705882355,0,2.9411764705882355]
[null,"4.7",{"$f":"A_4.7","v":0},2.9411764705882355,0,2.9411764705882355]
[null,"4.8",{"$f":"A_4.8","v":0},2.9411764705882355,0,2.9411764705882355]
[null,"4.9",{"$f":"A_4.9","v":0},2.9411764705882355,0,2.9411764705882355]
[null,"4.10",{"$f":"A_4.10","v":0},2.9411764705882355,0,2.9411764705882355]
[null,"4.11",{"$f":"A_4.11","v":0},2.9411764705882355,0,2.9411764705882355]
[null,"4.12",{"$f":"A_4.12","v":0},2.9411764705882355,0,2.9411764705882355]
[null,"4.13",{"$f":"A_4.13","v":0},2.9411764705882355,0,2.9411764705882355]
[null,"4.14",{"$f":"A_4.14","v":0},2.9411764705882355,0,2.9411764705882355]
[null,"4.15",{"$f":"A_4.15","v":0},2.9411764705882355,0,2.9411764705882355]
[null,"4.16",{"$f":"A_4.16","v":0},2.9411764705882355,0,2.9411764705882355]
[null,"4.17",{"$f":"A_4.17","v":0},2.9411764705882355,0,2.9411764705882355]
[null,"4.18",{"$f":"A_4.18","v":0},2.9411764705882355,0,2.9411764705882355]
[null,"4.19",{"$f":"A_4.19","v":0},2.9411764705882355,0,2.9411764705882355]
[null,"4.20",{"$f":"A_4.20","v":0},2.9411764705882355,0,2.9411764705882355]
[null,"4.21",{"$f":"A_4.21","v":0},2.9411764705882355,0,2.9411764705882355]
[null,"4.22",{"$f":"A_4.22","v":0},2.9411764705882355,0,2.9411764705882355]
[null,"4.23",{"$f":"A_4.23","v":0},2.9411764705882355,0,2.9411764705882355]
[null,"4.24",{"$f":"A_4.24","v":0},2.9411764705882355,0,2.9411764705882355]
[null,"4.25",{"$f":"A_4.25","v":0},2.9411764705882355,0,2.9411764705882355]
[null,"4.26",{"$f":"A_4.26","v":0},2.9411764705882355,0,2.9411764705882355]
[null,"4.27",{"$f":"A_4.27","v":0},2.9411764705882355,0,2.9411764705882355]
[null,"4.28",{"$f":"A_4.28","v":0},2.9411764705882355,0,2.9411764705882355]
[null,"4.29",{"$f":"A_4.29","v":0},2.9411764705882355,0,2.9411764705882355]
[null,"4.30",{"$f":"A_4.30","v":0},2.9411764705882355,0,2.9411764705882355]
[null,"4.31",{"$f":"A_4.31","v":0},2.9411764705882355,0,2.9411764705882355]
[null,"4.32",{"$f":"A_4.32","v":0},2.9411764705882355,0,2.9411764705882355]
[null,"4.33",{"$f":"A_4.33","v":0},2.9411764705882355,0,2.9411764705882355]
[null,"4.34",{"$f":"A_4.34","v":0},2.9411764705882355,0,2.9411764705882355]
[null,"5.1",{"$f":"A_5.1","v":0},12.5,{"$f":"IF((OR(C64=\"Yes\",C64=\"Not Applicable\")),D64,0)","v":0},{"$f":"D64","v":12.5}]
[null,"5.2",{"$f":"A_5.2","v":0},12.5,{"$f":"IF((OR(C65=\"Yes\",C65=\"Not Applicable\")),D65,0)","v":0},{"$f":"D65","v":12.5}]
[null,"5.3",{"$f":"A_5.3","v":0},12.5,{"$f":"IF((OR(C66=\"Yes\",C66=\"Not Applicable\")),D66,0)","v":0},12.5]
[null,"5.4",{"$f":"A_5.4","v":0},12.5,{"$f":"IF((OR(C67=\"Yes\",C67=\"Not Applicable\")),D67,0)","v":0},12.5]
[null,"5.5",{"$f":"A_5.5","v":0},12.5,{"$f":"IF((OR(C68=\"Yes\",C68=\"Not Applicable\")),D68,0)","v":0},12.5]
[null,"5.6",{"$f":"A_5.6","v":0},12.5,{"$f":"IF((OR(C69=\"Yes\",C69=\"Not Applicable\")),D69,0)","v":0},12.5]
[null,"5.7",{"$f":"A_5.7","v":0},12.5,0,12.5]
[null,"5.8",{"$f":"A_5.8","v":0},12.5,{"$f":"IF((OR(C71=\"Yes\",C71=\"Not Applicable\")),D71,0)","v":0},12.5]
[null,"6.1",{"$f":"A_6.1","v":0},6.66,{"$f":"IF((OR(C72=\"Yes\",C72=\"Not Applicable\")),D72,0)","v":0},{"$f":"D72","v":6.66}]
[null,"6.2",{"$f":"A_6.2","v":0},6.66,0,6.66]
[null,"6.3",{"$f":"A_6.3","v":0},6.66,0,6.66]
[null,"6.4",{"$f":"A_6.4","v":0},6.66,0,6.66]
[null,"6.5",{"$f":"A_6.5","v":0},6.66,0,6.66]
[null,"6.6",{"$f":"A_6.6","v":0},6.66,0,6.66]
[null,"6.7",{"$f":"A_6.7","v":0},6.66,0,6.66]
[null,"6.8",{"$f":"A_6.8","v":0},6.66,0,6.66]
[null,"6.9",{"$f":"A_6.9","v":0},6.66,0,6.66]
[null,"6.10",{"$f":"A_6.10","v":0},6.66,0,6.66]
[null,"6.11",{"$f":"A_6.11","v":0},6.66,0,6.66]
[null,"6.12",{"$f":"A_6.12","v":0},6.66,0,6.66]
[null,"6.13",{"$f":"A_6.13","v":0},6.66,0,6.66,{"$f":"SUM(D93:D99)","v":87.5},"<- check total equal 100"]
[null,"6.14",{"$f":"A_6.14","v":0},6.66,0,6.66]
[null,"6.15",{"$f":"A_6.15","v":0},6.76,0,6.76]
[null,"7.1",{"$f":"A_7.1","v":0},16.66,0,{"$f":"D87","v":16.66}]
[null,"7.2",{"$f":"A_7.2","v":0},16.66,0,16.66]
[null,"7.3",{"$f":"A_7.3","v":0},16.66,0,16.66]
[null,"7.4",{"$f":"A_7.4","v":0},16.66,0,16.66]
[null,"7.5",{"$f":"A_7.5","v":0},16.66,0,16.66]
[null,"7.6",{"$f":"A_7.6","v":0},16.7,0,16.7]
[null,"8.1",{"$f":"A_8.1","v":0},12.5,{"$f":"IF((OR(C93=\"Yes\",C93=\"Not Applicable\")),D93,0)","v":0},12.5]
[null,"8.2",{"$f":"A_8.2","v":0},12.5,0,12.5]
[null,"8.3",{"$f":"A_8.3","v":0},12.5,0,12.5]
[null,"8.4",{"$f":"A_8.4","v":0},12.5,0,12.5]
[null,"8.5",{"$f":"A_8.5","v":0},12.5,{"$f":"IF((OR(C97=\"Yes\",C97=\"Not Applicable\")),D97,0)","v":0},{"$f":"D97","v":12.5}]
[null,"8.6",{"$f":"A_8.6","v":0},12.5,{"$f":"IF((OR(C98=\"Yes\",C98=\"Not Applicable\")),D98,0)","v":0},{"$f":"D98","v":12.5}]
[null,"8.7",{"$f":"A_8.7","v":0},12.5,{"$f":"IF((OR(C99=\"Yes\",C99=\"Not Applicable\")),D99,0)","v":0},{"$f":"D99","v":12.5}]
[null,"8.8",{"$f":"A_8.8","v":0},12.5,{"$f":"IF((OR(C100=\"Yes\",C100=\"Not Applicable\")),D100,0)","v":0},{"$f":"D100","v":12.5}]
[null,"9.1",{"$f":"A_9.1","v":0},16.66,0,{"$f":"D101","v":16.66}]
[null,"9.2",{"$f":"A_9.2","v":0},16.66,0,16.66]
[null,"9.3",{"$f":"A_9.3","v":0},16.66,0,16.66]
[null,"9.4",{"$f":"A_9.4","v":0},16.66,0,16.66]
[null,"9.5",{"$f":"A_9.5","v":0},16.66,0,16.66]
[null,"9.6",{"$f":"A_9.6","v":0},16.7,0,16.7]
[null,"10.1",{"$f":"A_10.1","v":0},{"$f":"100/13","v":7.6923076923076925},{"$f":"IF((OR(C107=\"Yes\",C107=\"Not Applicable\")),D107,0)","v":0},7.6923076923076925]
[null,"10.2",{"$f":"A_10.2","v":0},7.6923076923076925,0,7.6923076923076925]
[null,"10.3",{"$f":"A_10.3","v":0},7.6923076923076925,0,7.6923076923076925]
[null,"10.4",{"$f":"A_10.4","v":0},7.6923076923076925,0,7.6923076923076925,{"$f":"SUM(D125:D137)","v":100},"<- check total equal 100"]
[null,"10.5",{"$f":"A_10.5","v":0},7.6923076923076925,0,7.6923076923076925]
[null,"10.6",{"$f":"A_10.6","v":0},7.6923076923076925,0,7.6923076923076925]
[null,"10.7",{"$f":"A_10.7","v":0},7.6923076923076925,0,7.6923076923076925]
[null,"10.8",{"$f":"A_10.8","v":0},7.6923076923076925,0,7.6923076923076925]
[null,"10.9",{"$f":"A_10.9","v":0},7.6923076923076925,0,7.6923076923076925]
[null,"10.10",{"$f":"A_10.10","v":0},7.6923076923076925,0,7.6923076923076925]
[null,"10.11",{"$f":"A_10.11","v":0},7.6923076923076925,0,7.6923076923076925]
[null,"10.12",{"$f":"A_10.12","v":0},7.6923076923076925,0,7.6923076923076925]
[null,"10.13",{"$f":"A_10.13","v":0},7.6923076923076925,0,7.6923076923076925]
[null,"11.1",{"$f":"A_11.1","v":0},20,0,{"$f":"D120","v":20}]
[null,"11.3",{"$f":"A_11.3","v":0},20,0,{"$f":"D121","v":20}]
[null,"11.4",{"$f":"A_11.4","v":0},20,0,{"$f":"D122","v":20}]
[null,"11.5",{"$f":"A_11.5","v":0},20,0,{"$f":"D123","v":20}]
[null,"11.6",{"$f":"A_11.6","v":0},20,0,{"$f":"D124","v":20}]
[null,"12.1",{"$f":"A_12.1","v":0},{"$f":"100/13","v":7.6923076923076925},{"$f":"IF((OR(C125=\"Yes\",C125=\"Not Applicable\")),D125,0)","v":0},{"$f":"100/13","v":7.6923076923076925}]
[null,"12.2",{"$f":"A_12.2","v":0},{"$f":"100/13","v":7.6923076923076925},0,{"$f":"100/13","v":7.6923076923076925}]
[null,"12.3",{"$f":"A_12.3","v":0},7.6923076923076925,0,7.6923076923076925]
[null,"12.4",{"$f":"A_12.4","v":0},7.6923076923076925,0,7.6923076923076925]
[null,"12.5",{"$f":"A_12.5","v":0},7.6923076923076925,0,7.6923076923076925]
[null,"12.6",{"$f":"A_12.6","v":0},7.6923076923076925,0,7.6923076923076925]
[null,"12.7",{"$f":"A_12.7","v":0},7.6923076923076925,0,7.6923076923076925]
[null,"12.8",{"$f":"A_12.8","v":0},7.6923076923076925,0,7.6923076923076925]
[null,"12.9",{"$f":"A_12.9","v":0},7.6923076923076925,0,7.6923076923076925]
[null,"12.10",{"$f":"A_12.10","v":0},7.6923076923076925,0,7.6923076923076925]
[null,"12.11",{"$f":"A_12.11","v":0},7.6923076923076925,0,7.6923076923076925]
[null,"12.12",{"$f":"A_12.12","v":0},7.6923076923076925,0,7.6923076923076925]
[null,"12.13",{"$f":"A_12.13","v":0},7.6923076923076925,0,7.6923076923076925]

{"sheet":"Lists","index":18,"n_rows":11,"n_cols":12,"rows_kept":11,"cut":false,"hidden":true,"merged":[]}
[]
[null,"3 Results & N/A",null,null,"2 Results & N/A",null,"3 Results ",null,"2 Results ",null,"Regions","Region Code"]
[null,"Conformance",null,null,"Yes",null,"Yes",null,"Yes",null,"Central Office","CEO"]
[null,"Partial Conformance",null,null,"No",null,"No",null,"No",null,"Central Qld","CQR"]
[null,"Non Conformance",null,null,"Not Applicable",null,"Partial",null,null,null,"Darling Downs - South West","DSR"]
[null,"Not Applicable",null,null,null,null,"Unanswered",null,null,null,"Far North Qld","FNQ"]
[null,null,null,null,null,null,null,null,null,null,"Metropolitan North","MNR"]
[null,null,null,null,null,null,null,null,null,null,"Metropolitan South","MSR"]
[null,null,null,null,null,null,null,null,null,null,"North Coast","NCR"]
[null,null,null,null,null,null,null,null,null,null,"North Qld","NQR"]
[null,null,null,null,null,null,null,null,null,null,"South East","SER"]

{"sheet":"Centre List","index":19,"n_rows":2715,"n_cols":2,"rows_kept":2715,"cut":false,"hidden":true,"merged":[]}
["Centre Name","Centre Code"]
["Abercorn State School",591]
["Abergowrie State School",1275]
["Acacia Ridge State School",25]
["Agnes Water State School",1983]
["Airville State School",598]
["Aitkenvale State School",801]
["Albany Creek State High School",2155]
["Albany Creek State School",190]
["Albany Hills State School",1892]
["Albert State School",38]
["Aldridge State High School",2017]
["Alexandra Bay State School",1963]
["Alexandra Hills State High School",2175]
["Alexandra Hills State School",405]
["Algester State School",1866]
["Allenstown State School",155]
["Alligator Creek State School",773]
["Allora P-10 State School",3]
["Alloway State School",430]
["Aloomba State School",870]
["Alpha State School",517]
["Amamoor State School",1719]
["Amaroo Environmental Education Centre",3553]
["Amberley District State School",115]
["Ambrose State School",1415]
["Amiens State School",1629]
["Anakie State School",474]
["Andergrove State School",1572]
["Annandale State School",440]
["Applethorpe State School",1294]
["Aramac State School",312]
["Aratula State School",1266]
["Arcadia Valley State School",813]
["Arundel State School",1997]
["Ascot State School",296]
["Ashgrove State School",186]
["Ashmore State School",1871]
["Ashwell State School",512]
["Aspley East State School",1004]
["Aspley Special School",3031]
["Aspley State High School",2076]
["Aspley State School",610]
["Atherton State High School",2051]
["Atherton State School",789]
["Augathella State School",357]
["Augusta State School",7120]
["Aurukun State School",274]
["Aviation High",2078]
["Avoca State School",1901]
["Avondale State School",572]
["Ayr State High School",2008]
["Ayr State School",451]
["Babinda State School",1466]
["Back Plains State School",317]
["Bajool State School",906]
["Balaclava State School",1689]
["Bald Hills State School",4]
["Ballandean State School",1164]
["Balmoral State High School",2043]
["Banana State School",521]
["Banksia Beach State School",1989]
["Baralaba State School",1605]
["Barambah Environmental Education Centre",3562]
["Barcaldine Prep-12 State School",531]
["Bardon State School",1041]
["Bargara State School",702]
["Baringa State Primary School","A109"]
["Baringa State Secondary College","A908"]
["Barkly Highway State School",777]
["Barrett Adolescent Centre Special School",3056]
["Bartle Frere State School",1730]
["Bauhinia State School",387]
["Bauple State School",966]
["Bay View State School",1798]
["Beachmere State School",1961]
["Beaconsfield State School",1672]
["Beaudesert State High School",2083]
["Beaudesert State School",158]
["Bedourie State School",1019]
["Beechmont State School",681]
["Beenleigh Special School",3051]
["Beenleigh State High School",2084]
["Beenleigh State School",6]
["Beerburrum State School",1598]
["Beerwah State High School",2109]
["Beerwah State School",569]
["Begonia State School",187]
["Belgian Gardens State School",509]
["Bell State School",781]
["Bellbird Park State School","B260"]
["Bellbird Park State Secondary College",9322]
["Bellenden Ker State School",1768]
["Bellevue Park State School",1925]
["Bellmere State School",9319]
["Belmont State School",226]
["Benaraby State School",393]
["Benarkin State School",1631]
["Benowa State High School",2150]
["Benowa State School",481]
["Bentley Park College",452]
["Berrinba East State School",1867]
["Berserker Street State School",1546]
["Biboohra State School",996]
["Biddeston State School",1663]
["Biggenden State School",666]
["Biggera Waters State School",65]
["Biloela State High School",2085]
["Biloela State School",1822]
["Binjour Plateau State School",1397]
["Birdsville State School",1679]
["Birkdale South State School",1915]
["Birkdale State School",1545]
["Blackall State School",299]
["Blackbutt State School",739]
["Blackwater North State School",1891]
["Blackwater State High School",2134]
["Blackwater State School",396]
["Blair State School",1565]
["Blenheim State School",316]
["Bli Bli State School",952]
["Bloomfield River State School",1173]
["Bloomsbury State School",981]
["Bluewater State School",612]
["Bluff State School",344]
["Bohlevale State School",1299]
["Bollon State School",425]
["Boonah State High School",2105]
["Boonah State School",333]
["Boondall State School",1603]
["Booyal Central State School",1542]
["Boronia Heights State School",1981]
["Bororen State School",899]
["Bouldercombe State School",57]
["Boulia State School",595]
["Bounty Boulevard State School",6134]
["Bowen State High School",2065]
["Bowen State School",10]
["Bowenville State School",815]
["Boyne Island Environmental Education Centre",3561]
["Boyne Island State School",1191]
["Boynewood State School",1465]
["Bracken Ridge State High School",2118]
["Bracken Ridge State School",772]
["Brandon State School",466]
["Branyan Road State School",1066]
["Brassall State School",571]
["Bray Park State High School",2173]
["Bray Park State School",339]
["Bremer State High School",2050]
["Bribie Island State High School",2181]
["Bribie Island State School",540]
["Brigalow State School",1133]
["Brighton State School",1669]
["Brightwater State School",7573]
["Brisbane Bayside State College",2104]
["Brisbane Central State School",207]
["Brisbane International Student Centre",5512]
["Brisbane School of Distance Education",3605]
["Brisbane South State Secondary College","A792"]
["Brisbane State High School",2003]
["Brisbane Urban Environmental Education Centre",3554]
["Brisbane Youth Education and Training Centre",2294]
["Broadbeach State School",1381]
["Broadwater State School",1071]
["Brookfield State School",16]
["Brookstead State School",311]
["Brooweena State School",1035]
["Browns Plains State High School",2164]
["Browns Plains State School",1922]
["Bucasia State School",1939]
["Buddina State School",1888]
["Buderim Mountain State School",223]
["Builyan State School",1124]
["Bulimba State School",17]
["Bullyard State School",962]
["Bundaberg Central State School",18]
["Bundaberg East State School",497]
["Bundaberg North State High School",2019]
["Bundaberg North State School",161]
["Bundaberg Regional Trade Training Centre",8388]
["Bundaberg South State School",637]
["Bundaberg Special School",3029]
["Bundaberg State High School",2004]
["Bundaberg West State School",1836]
["Bundamba State School",19]
["Bundamba State Secondary College",2130]
["Bungunya State School",1508]
["Bunker's Hill State School",853]
["Bunyaville Environmental Education Centre",3556]
["Buranda State School",894]
["Burdekin School",3003]
["Burketown State School",530]
["Burleigh Heads State School",1568]
["Burnett Heads State School",319]
["Burnett State College",2089]
["Burnside State High School",2145]
["Burnside State School",1873]
["Burpengary Meadows State School",5553]
["Burpengary State School",601]
["Burpengary State Secondary College",9676]
["Burra Burri State School",1129]
["Burrowes State School",1966]
["Butchers Creek State School",1427]
["Bwgcolman Community School",379]
["Byfield State School",1318]
["Bymount East State School",1047]
["Caboolture East State School",1903]
["Caboolture Special School",3045]
["Caboolture State High School",2066]
["Caboolture State School",369]
["Caboolture Watchhouse Education Support Hub","B298"]
["Cairns School of Distance Education",3601]
["Cairns State High School",2005]
["Cairns State Special School","A029"]
["Cairns West State School",1522]
["Calamvale Community College",1699]
["Calamvale Special School",3055]
["Calen District State College",1550]
["Calliope State High School",9790]
["Calliope State School",20]
["Caloundra State High School",2116]
["Caloundra State School",859]
["Cambooya State School",196]
["Cameron Downs State School",483]
["Camira State School",352]
["Camooweal State School",714]
["Camp Fairbairn Outdoor Education Centre",3572]
["Camp Hill State Infants and Primary School",1854]
["Caningeraba State School",1967]
["Cannon Hill State School",1476]
["Cannonvale State School",589]
["Canungra State School",566]
["Capalaba State College",5534]
["Cape York Aboriginal Australian Academy",8009]
["Capella State High School",2182]
["Capella State School",410]
["Capricornia (Emerald Campus) School of Distance Education",3612]
["Capricornia (Rockhampton Campus) School of Dist Ed",3613]
["Caravonica State School",927]
["Carbrook State School",278]
["Cardwell State School",136]
["Carina State School",1552]
["Carmila State School",1806]
["Carole Park State School",1044]
["Cavendish Road State High School",2025]
["Cawarral State School",135]
["Cecil Plains State School",734]
["Cedar Creek State School",160]
["Centenary Heights State High School",2121]
["Centenary State High School",1668]
["Central Queensland Region - Emerald (Regional Services)","A040"]
["Central Queensland Region - Gladstone (Regional Services)","A046"]
["Central Queensland Region - Longreach (Regional Services)",6651]
["Central Queensland Region - Mackay (Regional Services)","A044"]
["Central Queensland Region - Rockhampton (State Schooling)",6653]
["Chancellor State College",2282]
["Chapel Hill State School",1872]
["Charleville School of Distance Education",3602]
["Charleville State High School",2068]
["Charleville State School",185]
["Charters Towers Central State School",215]
["Charters Towers School of Distance Education",3610]
["Charters Towers State High School",2006]
["Chatswood Hills State School",1924]
["Chatsworth State School",915]
["Chelona State School",677]
["Cherbourg State School",989]
["Chevallum State School",1722]
["Childers State School",568]
["Chillagoe State School",866]
["Chinchilla State High School",2087]
["Chinchilla State School",244]
["Churchill State School",1789]
["Clare State School",171]
["Claremont Special School",3066]
["Clarendon State School",1732]
["Clarke Creek State School",606]
["Clermont State High School",2185]
["Clermont State School",21]
["Cleveland District State High School",2070]
["Cleveland Education and Training Centre",3160]
["Cleveland State School",22]
["Clifford Park Special School",3087]
["Clifton State High School",2111]
["Clifton State School",687]
["Clinton State School",172]
["Cloncurry State School P-12",411]
["Clontarf Beach State High School",2091]
["Clontarf Beach State School",162]
["Clover Hill State School",2345]
["Cloyna State School",1254]
["Coalstoun Lakes State School",1225]
["Coen Campus of CYAAA",1480]
["Collingwood Park State School",1956]
["Collinsville State High School",2171]
["Collinsville State School",1691]
["Columboola Environmental Education Centre",3564]
["Comet State School",173]
["Condamine State School",24]
["Coningsby State School",439]
["Conondale State School",1352]
["Cooktown State School",177]
["Coolabunia State School",638]
["Coolangatta State School",1630]
["Coolnwynpin State School",1927]
["Coolum State High School",2165]
["Coolum State School",1571]
["Coombabah State High School",2166]
["Coombabah State School",1909]
["Coomera Rivers State School",7122]
["Coomera Springs State School",5730]
["Coomera State School",124]
["Coomera State Special School","B016"]
["Coominya State School",1359]
["Coopers Plains State School",1247]
["Cooran State School",602]
["Cooroy State School",1165]
["Coorparoo Secondary College",2077]
["Coorparoo State School",219]
["Coowonga State School",32]
["Cooyar State School",1084]
["Coppabella State School",1898]
["Cordalba State School",117]
["Corinda State High School",2055]
["Corinda State School",1025]
["Craigslea State High School",2023]
["Craigslea State School",60]
["Cranbrook State School",1907]
["Crawford State School",399]
["Crescent Lagoon State School",762]
["Crestmead State School",1928]
["Crow's Nest State School",293]
["Croydon State School",165]
["Cunnamulla P-12 State School",289]
["Currajong State School",355]
["Currimundi Special School",3054]
["Currimundi State School",1868]
["Currumbin Community Special School",3043]
["Currumbin State School",1168]
["Currumbin Valley State School",775]
["Dagun State School",892]
["Daintree State School",1022]
["Daisy Hill State School",99]
["Dajarra State School",1670]
["Dakabin State High School",2142]
["Dakabin State School",1988]
["Dalby South State School",671]
["Dalby State High School",2033]
["Dalby State High School - Bunya Campus",7362]
["Dalby State High School - Student Residential",7596]
["Dalby State School",28]
["Dallarnil State School",950]
["Dalrymple Trade Training Centre",9679]
["Dalveen State School",318]
["Daradgee Environmental Education Centre",3581]
["Darling Heights State School",1900]
["Darling Point Special School",3025]
["Darlington State School",520]
["Darra State School",1520]
["Dayboro State School",191]
["DDSW Region - Chinchilla Office",5631]
["DDSW Region - Kingaroy Office",6657]
["DDSW Region - Roma Office",6659]
["DDSW Region - Toowoomba Office",6655]
["DDSW Region - Warwick Office",6658]
["Deception Bay North State School",1884]
["Deception Bay State High School",2107]
["Deception Bay State School",237]
["Deebing Heights State School",9916]
["Delaneys Creek State School",683]
["Denise Kable Youth Services Centre","B120"]
["Denison State School",392]
["Depot Hill State School",837]
["Dimbulah State School",1226]
["Dingo State School",266]
["Dirranbandi P-10 State School",1001]
["Doomadgee State School",330]
["Drayton State School",31]
["Drillham State School",889]
["Duaringa State School",342]
["Dulacca State School",1170]
["Dundula State School",1779]
["Dunkeld State School",934]
["Dunwich State School",784]
["Durack State School",959]
["Durong South State School",1667]
["Dutton Park State School",506]
["Dysart State High School",2156]
["Dysart State School",97]
["Eagle Junction State School",726]
["Eagleby Learning Centre - Centre for Continuing Secondary Education",3711]
["Eagleby South State School",1876]
["Eagleby State School",1974]
["Earnshaw State College",5180]
["East Ayr State School",908]
["East Brisbane State School",877]
["Eatons Hill State School",593]
["Edens Landing State School",301]
["Edge Hill State School",235]
["Eidsvold State School",581]
["Eight Mile Plains State School",34]
["Eimeo Road State School",545]
["El Arish State School",1758]
["Elanora State High School",2183]
["Elanora State School",1923]
["Elimbah State School",953]
["Elliott Heads State School",1347]
["Emerald North State School",1904]
["Emerald State High School",2122]
["Emerald State School",354]
["Emu Creek State School",154]
["Emu Park State School",473]
["Enoggera State School",35]
["Eromanga State School",1179]
["Esk State School",199]
["Eton State School",310]
["Eudlo State School",682]
["Eulo State School",222]
["Eumundi State School",698]
["Eungella State School",1353]
["Everleigh State School","B017"]
["Everton Park State High School",2061]
["Everton Park State School",1185]
["Fairview Heights State School",1751]
["Far North Queensland Region - Atherton Office",7196]
["Far North Queensland Region - Cairns Office",7197]
["Farleigh State School",1172]
["Farnborough State School",1027]
["Federal State School",1205]
["Feluga State School",810]
["Fernbrooke State School",9969]
["Fernvale State School",170]
["Ferny Grove State High School",2148]
["Ferny Grove State School",227]
["Ferny Hills State School",250]
["Fig Tree Pocket State School",36]
["Finch Hatton State School",1175]
["Fitzgerald State School",1883]
["Flagstone Creek State School",489]
["Flagstone State Community College",2323]
["Flagstone State School",471]
["Flying Fish Point State School",845]
["Forest Hill State School",697]
["Forest Lake State High School",1726]
["Forest Lake State School",1998]
["Forrest Beach State School",1897]
["Forsayth State School",523]
["Fortitude Valley State Secondary College","A722"]
["Foxwell State Secondary College","A788"]
["Freestone State School",40]
["Frenchville State School",940]
["Freshwater State School",1812]
["Gabbinbar State School",84]
["Gainsborough State School",9334]
["Garbutt State School",1434]
["Gargett State School",1460]
["Gatton State School",41]
["Gaven State School",1752]
["Gayndah State School",42]
["Geebung Special School",3077]
["Geebung State School",1257]
["Geham State School",54]
["Georgetown State School",178]
["Gilston State School",50]
["Gin Gin State High School",2131]
["Gin Gin State School",298]
["Gindie State School",709]
["Giru State School",1258]
["Givelda State School",749]
["Gladstone Central State School",44]
["Gladstone South State School",825]
["Gladstone State High School",2030]
["Gladstone West State School",740]
["Glamorgan Vale State School",149]
["Glass House Mountains State School",1242]
["Glen Aplin State School",544]
["Glenala State High School",1592]
["Glenden State School",1918]
["Gleneagle State School",1006]
["Glenella State School",313]
["Glenmore State High School",2028]
["Glenmore State School",574]
["Glenmorgan State School",917]
["Glennie Heights State School",770]
["Glenore Grove State School",1089]
["Glenvale State School",126]
["Glenview State School",337]
["Glenwood State School",1617]
["Gogango State School",552]
["Gold Coast International Student Centre",5485]
["Golden Beach State School",1920]
["Gooburrum State School",407]
["Goodna Special School",3034]
["Goodna State School",45]
["Goodwood State School",939]
["Goombungee State School",111]
["Goomeri State School",1310]
["Goondi State School",807]
["Goondiwindi State High School",2092]
["Goondiwindi State School",46]
["Goovigen State School",1839]
["Gordonvale State High School",2106]
["Gordonvale State School",790]
["Gowrie State School",297]
["Gracemere State School",47]
["Graceville State School",1515]
["Grand Avenue State School",1674]
["Grandchester State School",145]
["Grantham State School",1051]
["Granville State School",193]
["Greenbank State School",695]
["Greenlands State School",925]
["Greenmount State School",976]
["Greenslopes State School",614]
["Greenvale State School",334]
["Griffin State School",9339]
["Grosmont State School",1056]
["Grovely State School",1136]
["Guluguba State School",1549]
["Gumdale State School",1608]
["Gumlu State School",1391]
["Gunalda State School",58]
["Gundiah State School",821]
["Gympie Central State School",49]
["Gympie East State School",482]
["Gympie Schools Trade Training Centre",9915]
["Gympie South State School",1221]
["Gympie Special School",3007]
["Gympie State High School",2007]
["Gympie West State School",560]
["Haden State School",1329]
["Haigslea State School",114]
["Halifax State School",213]
["Hambledon State School",538]
["Hamilton Island State School",1962]
["Hamilton State School",1130]
["Hampden State School",529]
["Hannaford State School",1849]
["Happy Valley State School",843]
["Harlaxton State School",978]
["Harlin State School",902]
["Harris Fields State School",359]
["Harristown State High School",2038]
["Harristown State School",1292]
["Harrisville State School",621]
["Hatton Vale State School",390]
["Hayman Island State School",1060]
["Healy State School",232]
["Heatley Secondary College",2120]
["Heatley State School",305]
["Hebel State School",954]
["Helensvale State High School",2184]
["Helensvale State School",1929]
["Helidon State School",52]
["Hendra State School",33]
["Herberton State School",254]
["Herberton State School - Primary Campus",6140]
["Herberton State School - Secondary Campus",6141]
["Hercules Road State School",1858]
["Hermit Park State School",873]
["Hervey Bay Special School",3057]
["Hervey Bay State High School",2093]
["Highfields State School",53]
["Highfields State Secondary College",9340]
["Highland Reserve State School",6135]
["Hilder Road State School",1887]
["Hilliard State School",1986]
["Hillview State School",541]
["Holland Park State High School",2125]
["Holland Park State School",1593]
["Holloways Beach Environmental Education Centre",3582]
["Home Hill State High School",2094]
["Home Hill State School",1380]
["Homebush State School",470]
["Homestead State School",241]
["Hopevale Campus of CYAAA",243]
["Howard State School",345]
["Hughenden State School",388]
["Humpybong State School",164]
["Ilfracombe State School",713]
["Inala State School",1116]
["Indooroopilly State High School",2034]
["Indooroopilly State School",585]
["Ingham State High School",2027]
["Ingham State School",450]
["Ingleside State School",661]
["Inglewood State School",55]
["Injune P-10 State School",1723]
["Innisfail East State School",1660]
["Innisfail State College",6463]
["Innisfail State School",527]
["Ipswich Central State School",59]
["Ipswich East State School",575]
["Ipswich North State School",61]
["Ipswich Special School",3018]
["Ipswich State High School",2069]
["Ipswich West Special School",3015]
["Ipswich West State School",366]
["Ironside State School",108]
["Irvinebank State School",519]
["Isabella State School",1721]
["Isis District State High School",2063]
["Isisford State School",63]
["Ithaca Creek State School",455]
["Jacobs Well Environmental Education Centre",3552]
["Jambin State School",1659]
["Jamboree Heights State School",276]
["James Nash State High School",2137]
["Jandowae Prep-10 State School",537]
["Jarvisfield State School",798]
["Jericho State School",206]
["Jimboomba State School",604]
["Jimbour State School",1558]
["Jindalee State School",402]
["Jinibara State School",180]
["Jondaryan State School",64]
["Jones Hill State School",649]
["Julatten State School",1809]
["Julia Creek State School",1289]
["Junction Park State School",514]
["Jundah State School",910]
["Kaimkillenbun State School",1187]
["Kairi State School",1279]
["Kalamia State School",1494]
["Kalbar State School",343]
["Kalkie State School",277]
["Kallangur State School",605]
["Kandanga State School",1478]
["Karalee State School",1938]
["Karara State School",1145]
["Karumba State School",449]
["Kawana Waters State College",5653]
["Kawungan State School",1987]
["Kedron State High School",2039]
["Kedron State School",371]
["Keebra Park State High School",2046]
["Kelso State School",1960]
["Kelvin Grove State College",2409]
["Kenilworth State Community College",1309]
["Kenmore South State School",1143]
["Kenmore State High School",2132]
["Kenmore State School",923]
["Kennedy State School",868]
["Kentville State School",710]
["Kepnock State High School",2095]
["Keppel Sands State School",670]
["Kia-Ora State School",1707]
["Kilcoy State High School",2133]
["Kilcoy State School",679]
["Kilcummin State School",787]
["Kilkivan State School",168]
["Killarney P-10 State School",163]
["Kimberley Park State School",1937]
["Kin Kin State School",1534]
["Kin Kora State School",1912]
["Kinchant Dam Outdoor Education Centre",3579]
["Kindon State School",753]
["Kingaroy State High School",2044]
["Kingaroy State School",995]
["Kingsthorpe State School",1274]
["Kingston State College",2139]
["Kingston State School",1348]
["Kioma State School",415]
["Kippa-Ring State School",616]
["Kirwan State High School",2146]
["Kirwan State School",1862]
["Kogan State School",1078]
["Kolan South State School",279]
["Konomie Island Environmental Education Centre",3571]
["Koumala State School",1780]
["Kowanyama State School",460]
["Kruger State School",1878]
["Kulpi State School",1472]
["Kuluin State School",1968]
["Kumbia State School",1423]
["Kuraby Special School",3040]
["Kuraby State School",1462]
["Kuranda District State College",5689]
["Kurwongbah State School",1958]
["Labrador State School",443]
["Laidley District State School",1676]
["Laidley State High School",2163]
["Lake Clarendon State School",1009]
["Lakeland State School",202]
["Lakes Creek State School",67]
["Landsborough State School",349]
["Laura State School",583]
["Lawnton State School",329]
["Lee Street State Special School","A791"]
["Leichhardt State School",1148]
["Leyburn State School",68]
["Linville State School",980]
["Lochington State School",1119]
["Lockhart State School",505]
["Lockrose State School",1061]
["Lockyer District State High School",2062]
["Logan City Special School",3001]
["Logan Reserve State School",69]
["Logan Village State School",123]
["Loganholme State School",70]
["Loganlea State High School",2153]
["Longreach School of Distance Education",3611]
["Longreach State High School",2112]
["Longreach State School",711]
["Lota State School",882]
["Lower Tully State School",1010]
["Lowmead State School",1140]
["Lowood State High School",2160]
["Lowood State School",242]
["Lundavra State School",418]
["Ma Ma Creek State School",383]
["Mabel Park State High School",2161]
["Mabel Park State School",356]
["MacGregor State High School",2124]
["MacGregor State School",192]
["Machans Beach State School",758]
["Mackay Central State School",71]
["Mackay District Special School",3082]
["Mackay North State High School",2096]
["Mackay North State School",746]
["Mackay Northern Beaches State High School",7873]
["Mackay State High School",2009]
["Mackay West State School",501]
["Mackenzie State Primary School",608]
["Mackenzie State Special School",3012]
["Macknade State School",324]
["MacLeay Island State School",1959]
["Magnetic Island State School",1219]
["Maidavale State School",1214]
["Malanda State High School",2067]
["Malanda State School",1396]
["Maleny State High School",2177]
["Maleny State School",1390]
["Mango Hill State School",7575]
["Mango Hill State Secondary College","A787"]
["Manly State School",1222]
["Manly West State School",264]
["Mansfield State High School",2059]
["Mansfield State School",143]
["Mapleton State School",878]
["Marburg State School",320]
["Mareeba State High School",2058]
["Mareeba State School",653]
["Marian State School",518]
["Marlborough State School",1584]
["Marmor State School",1122]
["Maroochydore State High School",2097]
["Maroochydore State School",1711]
["Maroon Outdoor Education Centre",3550]
["Maroon State School",640]
["Maroondan State School",1251]
["Marsden State High School",2176]
["Marsden State School",1875]
["Marshall Road State School",708]
["Mary Valley State College",465]
["Maryborough Central State School",72]
["Maryborough Special School",3017]
["Maryborough State High School",2020]
["Maryborough West State School",485]
["Maryvale State School",1389]
["Mayfield State School",1090]
["McDonnell Creek State School",1400]
["McDowall State School",378]
["McIlwraith State School",1394]
["Meandarra State School",1473]
["Mena Creek State School",1673]
["Meridan State College",1733]
["Merinda State School",806]
["Meringandan State School",179]
["Merrimac State High School",2147]
["Merrimac State School",1586]
["Metro North Region - Nundah Office",9615]
["Metro South Region - Ipswich Office",7208]
["Metro South Region - Mt Gravatt Office",7215]
["Miallo State School",1291]
["Miami State High School",2086]
["Miami State School",1890]
["Middle Park State School",1969]
["Middle Ridge State School",414]
["Middlemount Community School",1905]
["Miles State High School",2144]
["Miles State School",341]
["Millaa Millaa State School",771]
["Millaroo State School",867]
["Millchester State School",157]
["Millmerran State School",176]
["Milman State School",1120]
["Milpera State High School",2024]
["Milton State School",551]
["Minden State School",294]
["Minimbah State School",265]
["Mirani State High School",2117]
["Mirani State School",658]
["Miriam Vale State School",792]
["Mirriwinni State School",1382]
["Mission Beach State School",1324]
["Mistake Creek State School",1919]
["Mitchell State School",27]
["Mitchelton Special School",3005]
["Mitchelton State High School",2040]
["Mitchelton State School",1538]
["Moffatdale State School",701]
["Moggill State School",73]
["Monkland State School",417]
["Monogorilby State School",1513]
["Monto State High School",2098]
["Monto State School",1831]
["Montville State School",776]
["Mooloolaba State School",1818]
["Mooloolah State School",309]
["Moonie State School",511]
["Moore Park Beach State School",1739]
["Moorooka State School",1637]
["Moranbah East State School",1908]
["Moranbah State High School",2135]
["Moranbah State School",896]
["Morayfield East State School",1985]
["Morayfield State High School",2154]
["Morayfield State School",125]
["Moreton Bay Environmental Education Centre",3567]
["Moreton Downs State School",1753]
["Morningside State School",1803]
["Mornington Island State School",291]
["Morven State School",525]
["Mossman State High School",2002]
["Mossman State School",167]
["Mount Alford State School",381]
["Mount Archer State School",1914]
["Mount Cotton State School",284]
["Mount Crosby State School",267]
["Mount Fox State School",1975]
["Mount Garnet State School",944]
["Mount Gravatt East State School",660]
["Mount Gravatt State High School",2056]
["Mount Gravatt State School",198]
["Mount Isa Central State School",1067]
["Mount Isa School of the Air",3604]
["Mount Isa Special School",3004]
["Mount Kilcoy State School",1166]
["Mount Larcom State School",300]
["Mount Marrow State School",1189]
["Mount Mee State School",690]
["Mount Molloy State School",1109]
["Mount Morgan Central State School",526]
["Mount Morgan State High School",2010]
["Mount Murchison State School",1511]
["Mount Nebo State School",737]
["Mount Ommaney Special School",3088]
["Mount Perry State School",75]
["Mount Samson State School",377]
["Mount Surprise State School",1531]
["Mount Sylvia State School",464]
["Mount Tarampa State School",1111]
["Mount Tyson State School",1037]
["Mount Warren Park State School",1906]
["Mount Whitestone State School",495]
["Mountain Creek State High School",2190]
["Mountain Creek State School",1999]
["Moura State High School",2136]
["Moura State School",932]
["Mourilyan State School",957]
["Mudgeeraba Creek State School",159]
["Mudgeeraba Special School",3049]
["Mudgeeraba State School",663]
["Mulgildie State School",1418]
["Mundingburra State School",436]
["Mundoo State School",722]
["Mundubbera State College",1420]
["Mungallala State School",507]
["Mungar State School",217]
["Murarrie State School",1469]
["Murgon State High School",2052]
["Murgon State School",871]
["Murphy's Creek State School",76]
["Murray River Upper State School",1030]
["Murray's Bridge State School",1177]
["Murrumba State Secondary College",7574]
["Musgrave Hill State School",1678]
["Mutarnee State School",1317]
["Mutchilba State School",993]
["Mutdapilly State School",152]
["Muttaburra State School",304]
["Nagoorin State School",1481]
["Nambour Special School",3039]
["Nambour State College",2031]
["Nambour State College - Junior School",363]
["Nanango State High School",2157]
["Nanango State School",77]
["Narangba State School",1200]
["Narangba Valley State High School",444]
["Narangba Valley State School",1725]
["Narbethong State Special School",3140]
["Nashville State School",479]
["Nebo State School",184]
["Nerang State High School",2169]
["Nerang State School",218]
["New Farm State School",943]
["Newmarket State School",228]
["Newtown State School",1227]
["Nirimba State Primary School","B018"]
["Nobby State School",1735]
["Noosa District State High School",2088]
["Noosa District State High School - Pomona Campus",2292]
["Noosaville State School",175]
["Norfolk Island Central School","B059"]
["Norfolk Village State School",1741]
["Norman Park State School",926]
["Normanton State School",360]
["Norris Road State School",1863]
["North Arm State School",469]
["North Coast Region - Bundaberg Office",6670]
["North Coast Region - Maroochydore Office",7586]
["North Coast Region - Maryborough Office",6671]
["North Coast Region - North Lakes Office",9923]
["North Eton State School",731]
["North Lakes State College",2324]
["North Queensland Region - Mount Isa Office",6646]
["North Queensland Region - Townsville Office",6644]
["North Rockhampton State High School",2041]
["North Shore State School","A069"]
["Northern Beaches State High School",211]
["Northern Peninsula Area College - Ama Mary Eseli Injinoo Campus",5704]
["Northern Peninsula Area College - Bamaga Junior Campus",5703]
["Northern Peninsula Area State College",1243]
["Northern Peninsula Area State College - Senior Campus",5971]
["Northgate State School",281]
["Northview State School",1957]
["Norville State School",445]
["Nudgee Beach Environmental Education Centre",3590]
["Numinbah Valley Environmental Education Centre",3558]
["Numinbah Valley State School",785]
["Nundah State School",43]
["Nursery Road State Special School",3084]
["Oakenden State School",1238]
["Oakey State High School",2099]
["Oakey State School",166]
["Oakleigh State School",331]
["Oakwood State School",620]
["One Mile State School",51]
["Oonoonba State School",556]
["Organisational Safety and Wellbeing",6555]
["Orion State School",1271]
["Ormeau State School",336]
["Ormeau Woods State High School",6136]
["Ormiston State School",23]
["Osborne State School",74]
["Oxenford State School",1970]
["Oxley State School",79]
["Pacific Paradise State School",1991]
["Pacific Pines State High School",1745]
["Pacific Pines State School",1744]
["Pallara State School",831]
["Palm Beach State School",240]
["Palm Beach-Currumbin State High School",2129]
["Palmview State Primary School","A907"]
["Palmview State Secondary College","A906"]
["Palmview State Special School","A905"]
["Palmwoods State School",592]
["Paluma Environmental Education Centre",3568]
["Park Avenue State School",983]
["Park Lake State School",5700]
["Park Ridge State High School",2187]
["Park Ridge State School",515]
["Parke State School",1467]
["Parkhurst State School",922]
["Parramatta State School",639]
["Patrick Estate State School",1486]
["Patricks Road State School",1864]
["Payne Road State School",286]
["Peachester State School",672]
["Peak Crossing State School",86]
["Pentland State School",467]
["Peregian Springs State School",1712]
["Petrie State School",183]
["Petrie Terrace State School",80]
["Pialba State School",419]
["Picnic Creek State School",9315]
["Pilton State School",422]
["Pimlico State High School",2049]
["Pimpama State Primary College",9331]
["Pimpama State School",81]
["Pimpama State Secondary College",8044]
["Pindi Pindi State School",1408]
["Pine Rivers Special School",3011]
["Pine Rivers State High School",2102]
["Pinnacle State School",1141]
["Pioneer State High School",2168]
["Pittsworth State High School",2119]
["Pittsworth State School",373]
["Pomona State School",720]
["Pormpuraaw State School",457]
["Port Curtis Road State School",208]
["Port Douglas State School",1979]
["Pozieres State School",1704]
["Prairie State School",488]
["Prenzlau State School",238]
["Proserpine State High School",2090]
["Proserpine State School",779]
["Prospect Creek State School",1655]
["Proston State School",1155]
["Pullenvale Environmental Education Centre",3565]
["Pullenvale State School",140]
["Pumicestone State School",9324]
["QCHS - Royal Brisbane and ACT for Kids Campus",3100]
["QRSS Peninsula Regional School Sport",2275]
["Queens Beach State School",1194]
["Queensland Academy for Creative Industries",5685]
["Queensland Academy for Health Sciences",5727]
["Queensland Academy for Science Mathematics and Technology",5684]
["Queensland Children's Hospital School",3102]
["Queensland Pathways State College",3036]
["Queensland Pathways State College - Bracken Ridge Campus","A085"]
["Queensland Pathways State College - Bundamba Campus","A070"]
["Queensland Pathways State College - Goodna Campus",9956]
["Queensland Pathways State College - Inner City Campus","A653"]
["Queensland Pathways State College - Mt Gravatt Campus",9199]
["Queensland Pathways State College - Townsville Campus","A104"]
["Quilpie State College",1594]
["Quinalow Prep-10 State School",958]
["Raceview State School",975]
["Railway Estate State School",1530]
["Rainbow Beach State School",1955]
["Rainworth State School",1491]
["Ramsay State School",29]
["Rangeville State School",1174]
["Rasmussen State School",1870]
["Rathdowney State School",1332]
["Ravenshoe State School - Junior Campus",6147]
["Ravenshoe State School - Senior Campus",6148]
["Ravenswood State School",141]
["Red Hill Special School",3085]
["Red Hill Special School - Ithaca Campus","A652"]
["Redbank Plains State High School",2174]
["Redbank Plains State School",88]
["Redbank State School",719]
["Redcliffe Special School",3009]
["Redcliffe State High School",2045]
["Redland Bay State School",229]
["Redland District Special School",3033]
["Redlynch State College",1336]
["Regents Park State School",1996]
["Richlands East State School",721]
["Richmond Hill State School",733]
["Richmond State School",576]
["Ridgelands State School",1489]
["Ripley Central State School","B118"]
["Ripley Valley State School","A790"]
["Ripley Valley State Secondary College","A797"]
["Riverview State School",1865]
["Roadvale State School",582]
["Robertson State School",1899]
["Robina State High School",195]
["Robina State School",1982]
["Rochedale South State School",1886]
["Rochedale State High School",2158]
["Rochedale State School",1638]
["Rockhampton North Special School",3038]
["Rockhampton Special School",3010]
["Rockhampton State High School",2011]
["Rocklea State School",454]
["Rockville State School",1786]
["Rolleston State School",92]
["Rollingstone State School",1325]
["Roma State College",5666]
["Ropeley State School",613]
["Rosedale State School",759]
["Rosella Park School",3002]
["Rosewood State High School",2151]
["Rosewood State School",131]
["Rossville State School",1977]
["Runaway Bay Sport and Leadership Excellence Centre",7192]
["Runcorn Heights State School",472]
["Runcorn State High School",2167]
["Runcorn State School",968]
["Russell Island State School",1488]
["Salisbury State School",1690]
["Samford State School",94]
["Sandgate District State High School",2047]
["Sandgate State School",153]
["Sandy Strait State School",1754]
["Sarina State High School",2101]
["Sarina State School",546]
["Scarborough State School",1560]
["Scenic Shores State School","B261"]
["Scottville State School",475]
["Seaforth State School",1479]
["Serviceton South State School",590]
["Seven Hills State School",1026]
["Severnlea State School",1007]
["Seville Road State School",1131]
["Shailer Park State High School",2149]
["Shailer Park State School",1916]
["Sharon State School",400]
["Sherwood State School",78]
["Shorncliffe State School",1623]
["Silkstone State School",247]
["Silkwood State School",1528]
["Slade Point State School",1853]
["Somerset Hills State School",692]
["South East Region - Hope Island Office",6620]
["South Johnstone State School",1518]
["South Rock State School","B119"]
["Southbrook Central State School",1241]
["Southport Campus",1826]
["Southport Special School",3026]
["Southport State High School",2037]
["Southport State School",368]
["Spinifex State College - Mount Isa - Junior Campus",5149]
["Spinifex State College - Mount Isa - Senior Campus",5148]
["Spinifex State College - Mount Isa - Student Residential",5151]
["Spinifex State College - Mount Isa Education and Training Precinct",5147]
["Spring Mountain State School","A657"]
["Springbrook State School",1931]
["Springfield Central State High School",7131]
["Springfield Central State School",7123]
["Springfield Lakes State School",5556]
["Springsure State School",102]
["Springwood Central State School",1869]
["Springwood Road State School",358]
["Springwood State High School",2140]
["St Bernard State School",1425]
["St George State High School",2143]
["St George State School",134]
["St Helens State School",236]
["St Lawrence State School",103]
["Stafford Heights State School",1016]
["Stafford State School",487]
["Stanley River Environmental Education Centre",3551]
["Stanthorpe State High School",2064]
["Stanthorpe State School",132]
["Stanwell State School",129]
["Stonehenge State School",933]
["Strathpine State School",1245]
["Strathpine West State School",1910]
["Stretton State College",5554]
["Sunbury State School",622]
["Sunnybank Hills State School",1889]
["Sunnybank Special School",3078]
["Sunnybank State High School",2080]
["Sunnybank State School",62]
["Sunset State School",965]
["Sunshine Beach State High School",2108]
["Sunshine Beach State School",1917]
["Sunshine Coast Environmental Education Centre",3580]
["Sunshine Coast International Student Centre",5488]
["Surat State School",142]
["Surfers Paradise State School",1295]
["Swayneville State School",1595]
["Taabinga State School",1096]
["Tagai State College",5726]
["Tagai State College - Badu Island Campus",1940]
["Tagai State College - Darnley Island Campus",1944]
["Tagai State College - Dauan Island Campus",1950]
["Tagai State College - Horn Island Campus",1995]
["Tagai State College - Kubin Campus",1949]
["Tagai State College - Mabuiag Island Campus",1942]
["Tagai State College - Malu Kiwai Campus",1941]
["Tagai State College - Mer Campus",1943]
["Tagai State College - Poruma Campus",1951]
["Tagai State College - Saibai Island Campus",1946]
["Tagai State College - St Pauls Campus",1953]
["Tagai State College - Stephen Island Campus",1952]
["Tagai State College - Thursday Island Primary Campus",463]
["Tagai State College - Thursday Island Secondary",2114]
["Tagai State College - Warraber Island Campus",1948]
["Tagai State College - Yam Island Campus",1947]
["Tagai State College - Yorke Island Campus",1945]
["Taigum State School",1112]
["Talara Primary College",462]
["Tallebudgera Outdoor and Environmental Education Centre",3555]
["Tallebudgera State School",201]
["Talwood State School",1615]
["Tambo State School",150]
["Tamborine Mountain State High School",2265]
["Tamborine Mountain State School",913]
["Tamrookum State School",1252]
["Tanduringie State School",1446]
["Tannum Sands State High School",231]
["Tannum Sands State School",1921]
["Tara Shire State College",1357]
["Tarampa State School",271]
["Taranganba State School",1992]
["Taroom State School",105]
["Teelba State School",494]
["Tent Hill Lower State School",106]
["Tewantin State School",181]
["Texas P-10 State School",437]
["Thabeban State School",1573]
["Thallon State School",1278]
["Thangool State School",1840]
["Thargomindah State School",409]
["The Caves State School",1018]
["The Gap State High School",2053]
["The Gap State School",1302]
["The Gums State School",1360]
["The Hall State School",1195]
["The Summit State School",1714]
["The Willows State School",287]
["Theebine State School",579]
["Theodore State School",676]
["Thornlands State School",1240]
["Thornton State School",245]
["Thulimbah State School",803]
["Thuringowa State High School",2172]
["Tiaro State School",107]
["Tieri State School",1926]
["Tin Can Bay State School",577]
["Tinana State School",216]
["Tinaroo Environmental Education Centre",3583]
["Tingalpa State School",127]
["Tingoora State School",864]
["Tivoli State School",224]
["Tolga State School",629]
["Toobanna State School",1777]
["Toogoolawah State High School",2179]
["Toogoolawah State School",1069]
["Toohey Forest Environmental Education Centre",2260]
["Toolooa State High School",2152]
["Toowong State School",13]
["Toowoomba East State School",499]
["Toowoomba North State School",110]
["Toowoomba State High School",2013]
["Toowoomba West Special School",3032]
["Torbanlea State School",522]
["Torquay State School",945]
["Townsville Central State School",113]
["Townsville Community Learning Centre - A State Special School",2376]
["Townsville South State School",303]
["Townsville State High School",2100]
["Townsville West State School",498]
["Townview State School",1203]
["Trebonne State School",1118]
["Tresswell State School",420]
["Trinity Bay State High School",2057]
["Tropical North Learning Academy - Smithfield State High School",2159]
["Tropical North Learning Academy - Trinity Beach State School",1893]
["Tullawong State High School",2188]
["Tullawong State School",1994]
["Tully State High School",2103]
["Tully State School",1008]
["Two Mile State School",361]
["Ubobo State School",879]
["Undurba State School",1877]
["Upper Brookfield State School",1501]
["Upper Coomera State College",2340]
["Upper Mount Gravatt State School",128]
["Urandangi State School",1755]
["Urangan Point State School",1536]
["Urangan State High School",2110]
["Vale View State School",844]
["Valkyrie State School",403]
["Varsity College",1759]
["Veresdale Scrub State School",869]
["Victoria Park State School",1855]
["Victoria Plantation State School",628]
["Victoria Point State High School",234]
["Victoria Point State School",1512]
["Vienna Woods State School",1936]
["Vincent State School",948]
["Virginia State School",1675]
["Walkamin State School",760]
["Walkerston State School",353]
["Walkervale State School",536]
["Wallangarra State School",458]
["Wallaville State School",1192]
["Walloon State School",285]
["Wallumbilla State School",182]
["Wamuran State School",1724]
["Wandoan State School P-10",1296]
["Waraburra State School",1971]
["Warra State School",386]
["Warrigal Road State School",1885]
["Warrill View State School",1230]
["Wartburg State School",1159]
["Warwick Central State School",116]
["Warwick East State School",225]
["Warwick State High School",2015]
["Warwick West State School",1152]
["Waterford State School",130]
["Waterford West State School",1856]
["Watson Road State School",584]
["Wavell Heights State School",1149]
["Wavell State High School",2048]
["Weir State School",395]
["Wellcamp State School",855]
["Wellers Hill State School",1844]
["Wellington Point State High School",2178]
["Wellington Point State School",273]
["West End State School",212]
["West Moreton Education and Training Centre ","A966"]
["Western Cape College - Mapoon",82]
["Western Cape College - Weipa",1407]
["Western Cape College Residential Centre",8014]
["Western Suburbs State Special School",3014]
["Westmar State School",1244]
["Westwood State School",119]
["Wheatlands State School",1405]
["Wheatvale State School",1147]
["White Rock State School",1978]
["Whites Hill State College",2410]
["Whitfield State School",1980]
["Widgee State School",669]
["William Duncan State School",1972]
["William Ross State High School",2186]
["Wilsonton State High School",468]
["Wilsonton State School",394]
["Wilston State School",1485]
["Windaroo State School",1990]
["Windaroo Valley State High School",2189]
["Windera State School",292]
["Windorah State School",461]
["Windsor State School",11]
["Winfield State School",603]
["Winton State School",478]
["Wishart State School",633]
["Withcott State School",1930]
["Wolvi State School",881]
["Wondai State School",1065]
["Wondall Heights State School",416]
["Wonga Beach State School",1614]
["Woodcrest State College",456]
["Woodford State School",370]
["Woodhill State School",122]
["WoodLinks State School",7121]
["Woodridge North State School",647]
["Woodridge State High School",2128]
["Woodridge State School",704]
["Woodstock State School",615]
["Woody Point Special School",3042]
["Woogaroo Creek State School","A918"]
["Woolooga State School",1378]
["Wooloowin State School",1463]
["Woombye State School",476]
["Woongarra State School",350]
["Woongoolba State School",39]
["Woorabinda State School",617]
["Wooroolin State School",947]
["Woree SHS - SchoolTech Campus",7383]
["Woree State High School",2162]
["Woree State School",1902]
["Worongary State School",1993]
["Wowan State School",919]
["Wulguru State School",547]
["Wyandra State School",802]
["Wynnum State High School",2021]
["Wynnum State School",6981]
["Wynnum West State School",1765]
["Wyreema State School",524]
["Yandaran State School",1634]
["Yandina State School",491]
["Yangan State School",151]
["Yarrabah State School - Kindergarten Campus",6129]
["Yarrabah State School - Primary Campus",6127]
["Yarrabah State School - Secondary Campus",6128]
["Yarrabilba State School","A068"]
["Yarrabilba State Secondary College","A789"]
["Yarraman State School",967]
["Yarrilee State School",1746]
["Yarwun State School",1098]
["Yelarbon State School",1346]
["Yeppoon State High School",2123]
["Yeppoon State School",442]
["Yeronga State High School",2054]
["Yeronga State School",8]
["Yorkeys Knob State School",757]
["Yugumbir State School",1954]
["Yuleba State School",372]
["Yungaburra State School",1002]
["Zillmere State School",275]
[]
[]
[]
["MLL name","MLL code"]
["Central Queensland Region - Rockhampton",6653]
["Noosa District State High School - Belli Park Campus","A661"]
["South East Region - Student Services","A052"]
["Sunshine Coast Environmental Education Centre - Sunday Creek Campsite",3559]
["West Moreton Education and Training Centre","A966"]
["Abercorn State School",591]
["Abergowrie State School",1275]
["Acacia Ridge State School",25]
["Agnes Water State School",1983]
["Airville State School",598]
["Aitkenvale State School",801]
["Albany Creek State High School",2155]
["Albany Creek State School",190]
["Albany Hills State School",1892]
["Albert State School",38]
["Aldridge State High School",2017]
["Alexandra Bay State School",1963]
["Alexandra Hills State High School",2175]
["Alexandra Hills State School",405]
["Algester State School",1866]
["Allenstown State School",155]
["Alligator Creek State School",773]
["Allora P-10 State School",3]
["Alloway State School",430]
["Aloomba State School",870]
["Alpha State School",517]
["Amamoor State School",1719]
["Amaroo Environmental Education Centre",3553]
["Amberley District State School",115]
["Ambrose State School",1415]
["Amiens State School",1629]
["Anakie State School",474]
["Andergrove State School",1572]
["Annandale State School",440]
["Applethorpe State School",1294]
["Aramac State School",312]
["Aratula State School",1266]
["Arcadia Valley State School",813]
["Arundel State School",1997]
["Ascot State School",296]
["Ashgrove State School",186]
["Ashmore State School",1871]
["Ashwell State School",512]
["Aspley East State School",1004]
["Aspley Special School",3031]
["Aspley State High School",2076]
["Aspley State School",610]
["Atherton State High School",2051]
["Atherton State School",789]
["Augathella State School",357]
["Augusta State School",7120]
["Aurukun State School",274]
["Aviation High",2078]
["Avoca State School",1901]
["Avondale State School",572]
["Ayr State High School",2008]
["Ayr State School",451]
["Babinda State School",1466]
["Back Plains State School",317]
["Bajool State School",906]
["Balaclava State School",1689]
["Bald Hills State School",4]
["Ballandean State School",1164]
["Balmoral State High School",2043]
["Banana State School",521]
["Banksia Beach State School",1989]
["Baralaba State School",1605]
["Barambah Environmental Education Centre",3562]
["Barcaldine Prep-12 State School",531]
["Bardon State School",1041]
["Bargara State School",702]
["Baringa State Primary School","A109"]
["Baringa State Secondary College","A908"]
["Barkly Highway State School",777]
["Barrett Adolescent Centre Special School",3056]
["Bartle Frere State School",1730]
["Bauhinia State School",387]
["Bauple State School",966]
["Bay View State School",1798]
["Beachmere State School",1961]
["Beaconsfield State School",1672]
["Beaudesert State High School",2083]
["Beaudesert State School",158]
["Bedourie State School",1019]
["Beechmont State School",681]
["Beenleigh Special School",3051]
["Beenleigh State High School",2084]
["Beenleigh State School",6]
["Beerburrum State School",1598]
["Beerwah State High School",2109]
["Beerwah State School",569]
["Begonia State School",187]
["Belgian Gardens State School",509]
["Bell State School",781]
["Bellbird Park State Secondary College",9322]
["Bellenden Ker State School",1768]
["Bellevue Park State School",1925]
["Bellmere State School",9319]
["Belmont State School",226]
["Benaraby State School",393]
["Benarkin State School",1631]
["Benowa State High School",2150]
["Benowa State School",481]
["Bentley Park College",452]
["Berrinba East State School",1867]
["Berserker Street State School",1546]
["Biboohra State School",996]
["Biddeston State School",1663]
["Biggenden State School",666]
["Biggera Waters State School",65]
["Biloela State High School",2085]
["Biloela State School",1822]
["Binjour Plateau State School",1397]
["Birdsville State School",1679]
["Birkdale South State School",1915]
["Birkdale State School",1545]
["Blackall State School",299]
["Blackbutt State School",739]
["Blackwater North State School",1891]
["Blackwater State High School",2134]
["Blackwater State School",396]
["Blair State School",1565]
["Blenheim State School",316]
["Bli Bli State School",952]
["Bloomfield River State School",1173]
["Bloomsbury State School",981]
["Bluewater State School",612]
["Bluff State School",344]
["Bohlevale State School",1299]
["Bollon State School",425]
["Boonah State High School",2105]
["Boonah State School",333]
["Boondall State School",1603]
["Booyal Central State School",1542]
["Boronia Heights State School",1981]
["Bororen State School",899]
["Bouldercombe State School",57]
["Boulia State School",595]
["Bounty Boulevard State School",6134]
["Bowen State High School",2065]
["Bowen State School",10]
["Bowenville State School",815]
["Boyne Island Environmental Education Centre",3561]
["Boyne Island State School",1191]
["Boynewood State School",1465]
["Bracken Ridge State High School",2118]
["Bracken Ridge State School",772]
["Brandon State School",466]
["Branyan Road State School",1066]
["Brassall State School",571]
["Bray Park State High School",2173]
["Bray Park State School",339]
["Bremer State High School",2050]
["Bribie Island State High School",2181]
["Bribie Island State School",540]
["Brigalow State School",1133]
["Brighton State School",1669]
["Brightwater State School",7573]
["Brisbane Bayside State College",2104]
["Brisbane Central State School",207]
["Brisbane School of Distance Education",3605]
["Brisbane South State Secondary College","A792"]
["Brisbane State High School",2003]
["Brisbane Urban Environmental Education Centre",3554]
["Brisbane Youth Education and Training Centre",2294]
["Broadbeach State School",1381]
["Broadwater State School",1071]
["Brookfield State School",16]
["Brookstead State School",311]
["Brooweena State School",1035]
["Browns Plains State High School",2164]
["Browns Plains State School",1922]
["Bucasia State School",1939]
["Buddina State School",1888]
["Buderim Mountain State School",223]
["Builyan State School",1124]
["Bulimba State School",17]
["Bullyard State School",962]
["Bundaberg Central State School",18]
["Bundaberg East State School",497]
["Bundaberg North State High School",2019]
["Bundaberg North State School",161]
["Bundaberg Regional Trade Training Centre",8388]
["Bundaberg South State School",637]
["Bundaberg Special School",3029]
["Bundaberg State High School",2004]
["Bundaberg West State School",1836]
["Bundamba State School",19]
["Bundamba State Secondary College",2130]
["Bunker's Hill State School",853]
["Bunyaville Environmental Education Centre",3556]
["Buranda State School",894]
["Burdekin School",3003]
["Burketown State School",530]
["Burleigh Heads State School",1568]
["Burnett Heads State School",319]
["Burnett State College",2089]
["Burnside State High School",2145]
["Burnside State School",1873]
["Burpengary Meadows State School",5553]
["Burpengary State School",601]
["Burpengary State Secondary College",9676]
["Burrowes State School",1966]
["Butchers Creek State School",1427]
["Bwgcolman Community School",379]
["Byfield State School",1318]
["Bymount East State School",1047]
["Caboolture East State School",1903]
["Caboolture Special School",3045]
["Caboolture State High School",2066]
["Caboolture State School",369]
["Caboolture Watchhouse Education Support Hub","B298"]
["Cairns School of Distance Education",3601]
["Cairns State High School",2005]
["Cairns State Special School","A029"]
["Cairns West State School",1522]
["Calamvale Community College",1699]
["Calamvale Special School",3055]
["Calen District State College",1550]
["Calliope State High School",9790]
["Calliope State School",20]
["Caloundra State High School",2116]
["Caloundra State School",859]
["Cambooya State School",196]
["Cameron Downs State School",483]
["Camira State School",352]
["Camooweal State School",714]
["Camp Fairbairn Outdoor Education Centre",3572]
["Camp Hill State Infants and Primary School",1854]
["Caningeraba State School",1967]
["Cannon Hill State School",1476]
["Cannonvale State School",589]
["Canungra State School",566]
["Capalaba State College",5534]
["Capella State High School",2182]
["Capella State School",410]
["Capricornia (Emerald Campus) School of Distance Education",3612]
["Capricornia (Rockhampton Campus) School of Dist Ed",3613]
["Caravonica State School",927]
["Carbrook State School",278]
["Cardwell State School",136]
["Carina State School",1552]
["Carmila State School",1806]
["Carole Park State School",1044]
["Cavendish Road State High School",2025]
["Cawarral State School",135]
["Cecil Plains State School",734]
["Cedar Creek State School",160]
["Centenary Heights State High School",2121]
["Centenary State High School",1668]
["Chancellor State College",2282]
["Chapel Hill State School",1872]
["Charleville School of Distance Education",3602]
["Charleville State High School",2068]
["Charleville State School",185]
["Charters Towers Central State School",215]
["Charters Towers School of Distance Education",3610]
["Charters Towers State High School",2006]
["Chatswood Hills State School",1924]
["Chatsworth State School",915]
["Chelona State School",677]
["Cherbourg State School",989]
["Chevallum State School",1722]
["Childers State School",568]
["Chillagoe State School",866]
["Chinchilla State High School",2087]
["Chinchilla State School",244]
["Churchill State School",1789]
["Clare State School",171]
["Claremont Special School",3066]
["Clarendon State School",1732]
["Clarke Creek State School",606]
["Clermont State High School",2185]
["Clermont State School",21]
["Cleveland District State High School",2070]
["Cleveland Education and Training Centre",3160]
["Cleveland State School",22]
["Clifford Park Special School",3087]
["Clifton State High School",2111]
["Clifton State School",687]
["Clinton State School",172]
["Cloncurry State School P-12",411]
["Clontarf Beach State High School",2091]
["Clontarf Beach State School",162]
["Clover Hill State School",2345]
["Cloyna State School",1254]
["Coalstoun Lakes State School",1225]
["Coen Campus of CYAAA",1480]
["Collingwood Park State School",1956]
["Collinsville State High School",2171]
["Collinsville State School",1691]
["Columboola Environmental Education Centre",3564]
["Comet State School",173]
["Condamine State School",24]
["Coningsby State School",439]
["Conondale State School",1352]
["Cooktown State School",177]
["Coolabunia State School",638]
["Coolangatta State School",1630]
["Coolnwynpin State School",1927]
["Coolum State High School",2165]
["Coolum State School",1571]
["Coombabah State High School",2166]
["Coombabah State School",1909]
["Coomera Rivers State School",7122]
["Coomera Springs State School",5730]
["Coomera State School",124]
["Coomera State Special School","B016"]
["Coominya State School",1359]
["Coopers Plains State School",1247]
["Cooran State School",602]
["Cooroy State School",1165]
["Coorparoo Secondary College",2077]
["Coorparoo State School",219]
["Coowonga State School",32]
["Cooyar State School",1084]
["Coppabella State School",1898]
["Cordalba State School",117]
["Corinda State High School",2055]
["Corinda State School",1025]
["Craigslea State High School",2023]
["Craigslea State School",60]
["Cranbrook State School",1907]
["Crawford State School",399]
["Crescent Lagoon State School",762]
["Crestmead State School",1928]
["Crow's Nest State School",293]
["Croydon State School",165]
["Cunnamulla P-12 State School",289]
["Currajong State School",355]
["Currimundi Special School",3054]
["Currimundi State School",1868]
["Currumbin Community Special School",3043]
["Currumbin State School",1168]
["Currumbin Valley State School",775]
["Dagun State School",892]
["Daintree State School",1022]
["Daisy Hill State School",99]
["Dajarra State School",1670]
["Dakabin State High School",2142]
["Dakabin State School",1988]
["Dalby South State School",671]
["Dalby State High School",2033]
["Dalby State High School - Bunya Campus",7362]
["Dalby State School",28]
["Dallarnil State School",950]
["Dalrymple Trade Training Centre",9679]
["Dalveen State School",318]
["Daradgee Environmental Education Centre",3581]
["Darling Heights State School",1900]
["Darling Point Special School",3025]
["Darlington State School",520]
["Darra State School",1520]
["Dayboro State School",191]
["DDSW Region - Chinchilla Office",5631]
["DDSW Region - Kingaroy Office",6657]
["DDSW Region - Roma Office",6659]
["DDSW Region - Toowoomba Office",6655]
["DDSW Region - Warwick Office",6658]
["Deception Bay North State School",1884]
["Deception Bay State High School",2107]
["Deception Bay State School",237]
["Deebing Heights State School",9916]
["Delaneys Creek State School",683]
["Denise Kable Youth Services Centre","B120"]
["Denison State School",392]
["Depot Hill State School",837]
["Dimbulah State School",1226]
["Dingo State School",266]
["Dirranbandi P-10 State School",1001]
["Doomadgee State School",330]
["Drayton State School",31]
["Drillham State School",889]
["Duaringa State School",342]
["Dulacca State School",1170]
["Dundula State School",1779]
["Dunkeld State School",934]
["Dunwich State School",784]
["Durack State School",959]
["Durong South State School",1667]
["Dutton Park State School",506]
["Dysart State High School",2156]
["Dysart State School",97]
["Eagle Junction State School",726]
["Eagleby Learning Centre - Centre for Continuing Secondary Education",3711]
["Eagleby South State School",1876]
["Eagleby State School",1974]
["Earnshaw State College",5180]
["East Ayr State School",908]
["East Brisbane State School",877]
["Eatons Hill State School",593]
["Edens Landing State School",301]
["Edge Hill State School",235]
["Eidsvold State School",581]
["Eight Mile Plains State School",34]
["Eimeo Road State School",545]
["El Arish State School",1758]
["Elanora State High School",2183]
["Elanora State School",1923]
["Elimbah State School",953]
["Elliott Heads State School",1347]
["Emerald North State School",1904]
["Emerald State High School",2122]
["Emerald State School",354]
["Emu Creek State School",154]
["Emu Park State School",473]
["Enoggera State School",35]
["Eromanga State School",1179]
["Esk State School",199]
["Eton State School",310]
["Eudlo State School",682]
["Eulo State School",222]
["Eumundi State School",698]
["Eungella State School",1353]
["Everleigh State School","B017"]
["Everton Park State High School",2061]
["Everton Park State School",1185]
["Fairview Heights State School",1751]
["Far North Queensland Region - Atherton Office",7196]
["Far North Queensland Region - Cairns Office",7197]
["Farleigh State School",1172]
["Farnborough State School",1027]
["Federal State School",1205]
["Feluga State School",810]
["Fernbrooke State School",9969]
["Fernvale State School",170]
["Ferny Grove State High School",2148]
["Ferny Grove State School",227]
["Ferny Hills State School",250]
["Fig Tree Pocket State School",36]
["Finch Hatton State School",1175]
["Fitzgerald State School",1883]
["Flagstone Creek State School",489]
["Flagstone State Community College",2323]
["Flagstone State School",471]
["Flying Fish Point State School",845]
["Forest Hill State School",697]
["Forest Lake State High School",1726]
["Forest Lake State School",1998]
["Forrest Beach State School",1897]
["Forsayth State School",523]
["Fortitude Valley State Secondary College","A722"]
["Foxwell State Secondary College","A788"]
["Freestone State School",40]
["Frenchville State School",940]
["Freshwater State School",1812]
["Gabbinbar State School",84]
["Gainsborough State School",9334]
["Garbutt State School",1434]
["Gargett State School",1460]
["Gatton State School",41]
["Gaven State School",1752]
["Gayndah State School",42]
["Geebung Special School",3077]
["Geebung State School",1257]
["Geham State School",54]
["Georgetown State School",178]
["Gilston State School",50]
["Gin Gin State High School",2131]
["Gin Gin State School",298]
["Gindie State School",709]
["Giru State School",1258]
["Gladstone Central State School",44]
["Gladstone South State School",825]
["Gladstone State High School",2030]
["Gladstone West State School",740]
["Glamorgan Vale State School",149]
["Glass House Mountains State School",1242]
["Glen Aplin State School",544]
["Glenala State High School",1592]
["Glenden State School",1918]
["Gleneagle State School",1006]
["Glenella State School",313]
["Glenmore State High School",2028]
["Glenmore State School",574]
["Glenmorgan State School",917]
["Glennie Heights State School",770]
["Glenore Grove State School",1089]
["Glenvale State School",126]
["Glenview State School",337]
["Glenwood State School",1617]
["Gogango State School",552]
["Golden Beach State School",1920]
["Gooburrum State School",407]
["Goodna Special School",3034]
["Goodna State School",45]
["Goodwood State School",939]
["Goombungee State School",111]
["Goomeri State School",1310]
["Goondi State School",807]
["Goondiwindi State High School",2092]
["Goondiwindi State School",46]
["Goovigen State School",1839]
["Gordonvale State High School",2106]
["Gordonvale State School",790]
["Gowrie State School",297]
["Gracemere State School",47]
["Graceville State School",1515]
["Grand Avenue State School",1674]
["Grandchester State School",145]
["Grantham State School",1051]
["Granville State School",193]
["Greenbank State School",695]
["Greenlands State School",925]
["Greenmount State School",976]
["Greenslopes State School",614]
["Greenvale State School",334]
["Griffin State School",9339]
["Grovely State School",1136]
["Guluguba State School",1549]
["Gumdale State School",1608]
["Gumlu State School",1391]
["Gunalda State School",58]
["Gundiah State School",821]
["Gympie Central State School",49]
["Gympie East State School",482]
["Gympie South State School",1221]
["Gympie Special School",3007]
["Gympie State High School",2007]
["Gympie West State School",560]
["Haden State School",1329]
["Haigslea State School",114]
["Halifax State School",213]
["Hambledon State School",538]
["Hamilton Island State School",1962]
["Hamilton State School",1130]
["Hampden State School",529]
["Hannaford State School",1849]
["Happy Valley State School",843]
["Harlaxton State School",978]
["Harlin State School",902]
["Harris Fields State School",359]
["Harristown State High School",2038]
["Harristown State School",1292]
["Harrisville State School",621]
["Hatton Vale State School",390]
["Hayman Island State School",1060]
["Healy State School",232]
["Heatley Secondary College",2120]
["Heatley State School",305]
["Hebel State School",954]
["Helensvale State High School",2184]
["Helensvale State School",1929]
["Helidon State School",52]
["Hendra State School",33]
["Herberton State School - Primary Campus",6140]
["Herberton State School - Secondary Campus",6141]
["Hercules Road State School",1858]
["Hermit Park State School",873]
["Hervey Bay Special School",3057]
["Hervey Bay State High School",2093]
["Highfields State School",53]
["Highfields State Secondary College",9340]
["Highland Reserve State School",6135]
["Hilder Road State School",1887]
["Hilliard State School",1986]
["Hillview State School",541]
["Holland Park State High School",2125]
["Holland Park State School",1593]
["Holloways Beach Environmental Education Centre",3582]
["Home Hill State High School",2094]
["Home Hill State School",1380]
["Homebush State School",470]
["Homestead State School",241]
["Hopevale Campus of CYAAA",243]
["Howard State School",345]
["Hughenden State School",388]
["Humpybong State School",164]
["Ilfracombe State School",713]
["Inala State School",1116]
["Indooroopilly State High School",2034]
["Indooroopilly State School",585]
["Ingham State High School",2027]
["Ingham State School",450]
["Ingleside State School",661]
["Inglewood State School",55]
["Injune P-10 State School",1723]
["Innisfail East State School",1660]
["Innisfail State College",6463]
["Innisfail State School",527]
["Ipswich Central State School",59]
["Ipswich East State School",575]
["Ipswich North State School",61]
["Ipswich Special School",3018]
["Ipswich State High School",2069]
["Ipswich West Special School",3015]
["Ipswich West State School",366]
["Ironside State School",108]
["Irvinebank State School",519]
["Isabella State School",1721]
["Isis District State High School",2063]
["Isisford State School",63]
["Ithaca Creek State School",455]
["Jacobs Well Environmental Education Centre",3552]
["Jambin State School",1659]
["Jamboree Heights State School",276]
["James Nash State High School",2137]
["Jandowae Prep-10 State School",537]
["Jarvisfield State School",798]
["Jericho State School",206]
["Jimboomba State School",604]
["Jimbour State School",1558]
["Jindalee State School",402]
["Jinibara State School",180]
["Jondaryan State School",64]
["Jones Hill State School",649]
["Julatten State School",1809]
["Julia Creek State School",1289]
["Junction Park State School",514]
["Jundah State School",910]
["Kaimkillenbun State School",1187]
["Kairi State School",1279]
["Kalamia State School",1494]
["Kalbar State School",343]
["Kalkie State School",277]
["Kallangur State School",605]
["Kandanga State School",1478]
["Karalee State School",1938]
["Karara State School",1145]
["Karumba State School",449]
["Kawana Waters State College",5653]
["Kawungan State School",1987]
["Kedron State High School",2039]
["Kedron State School",371]
["Keebra Park State High School",2046]
["Kelso State School",1960]
["Kelvin Grove State College",2409]
["Kenilworth State Community College",1309]
["Kenmore South State School",1143]
["Kenmore State High School",2132]
["Kenmore State School",923]
["Kennedy State School",868]
["Kentville State School",710]
["Kepnock State High School",2095]
["Keppel Sands State School",670]
["Kia-Ora State School",1707]
["Kilcoy State High School",2133]
["Kilcoy State School",679]
["Kilcummin State School",787]
["Kilkivan State School",168]
["Killarney P-10 State School",163]
["Kimberley Park State School",1937]
["Kin Kin State School",1534]
["Kin Kora State School",1912]
["Kinchant Dam Outdoor Education Centre",3579]
["Kindon State School",753]
["Kingaroy State High School",2044]
["Kingaroy State School",995]
["Kingsthorpe State School",1274]
["Kingston State College",2139]
["Kingston State School",1348]
["Kioma State School",415]
["Kippa-Ring State School",616]
["Kirwan State High School",2146]
["Kirwan State School",1862]
["Kogan State School",1078]
["Kolan South State School",279]
["Konomie Island Environmental Education Centre",3571]
["Koumala State School",1780]
["Kowanyama State School",460]
["Kruger State School",1878]
["Kulpi State School",1472]
["Kuluin State School",1968]
["Kumbia State School",1423]
["Kuraby Special School",3040]
["Kuraby State School",1462]
["Kuranda District State College",5689]
["Kurwongbah State School",1958]
["Labrador State School",443]
["Laidley District State School",1676]
["Laidley State High School",2163]
["Lake Clarendon State School",1009]
["Lakeland State School",202]
["Lakes Creek State School",67]
["Landsborough State School",349]
["Laura State School",583]
["Lawnton State School",329]
["Lee Street State Special School","A791"]
["Leichhardt State School",1148]
["Leyburn State School",68]
["Linville State School",980]
["Lochington State School",1119]
["Lockhart State School",505]
["Lockrose State School",1061]
["Lockyer District State High School",2062]
["Logan City Special School",3001]
["Logan Reserve State School",69]
["Logan Village State School",123]
["Loganholme State School",70]
["Loganlea State High School",2153]
["Longreach School of Distance Education",3611]
["Longreach State High School",2112]
["Longreach State School",711]
["Lota State School",882]
["Lower Tully State School",1010]
["Lowmead State School",1140]
["Lowood State High School",2160]
["Lowood State School",242]
["Ma Ma Creek State School",383]
["Mabel Park State High School",2161]
["Mabel Park State School",356]
["MacGregor State High School",2124]
["MacGregor State School",192]
["Machans Beach State School",758]
["Mackay Central State School",71]
["Mackay District Special School",3082]
["Mackay North State High School",2096]
["Mackay North State School",746]
["Mackay Northern Beaches State High School",7873]
["Mackay State High School",2009]
["Mackay West State School",501]
["Mackenzie State Primary School",608]
["Mackenzie State Special School",3012]
["Macknade State School",324]
["MacLeay Island State School",1959]
["Magnetic Island State School",1219]
["Maidavale State School",1214]
["Malanda State High School",2067]
["Malanda State School",1396]
["Maleny State High School",2177]
["Maleny State School",1390]
["Mango Hill State School",7575]
["Mango Hill State Secondary College","A787"]
["Manly State School",1222]
["Manly West State School",264]
["Mansfield State High School",2059]
["Mansfield State School",143]
["Mapleton State School",878]
["Marburg State School",320]
["Mareeba State High School",2058]
["Mareeba State School",653]
["Marian State School",518]
["Marlborough State School",1584]
["Marmor State School",1122]
["Maroochydore State High School",2097]
["Maroochydore State School",1711]
["Maroon Outdoor Education Centre",3550]
["Maroon State School",640]
["Maroondan State School",1251]
["Marsden State High School",2176]
["Marsden State School",1875]
["Marshall Road State School",708]
["Mary Valley State College",465]
["Maryborough Central State School",72]
["Maryborough Special School",3017]
["Maryborough State High School",2020]
["Maryborough West State School",485]
["Maryvale State School",1389]
["Mayfield State School",1090]
["McDonnell Creek State School",1400]
["McDowall State School",378]
["McIlwraith State School",1394]
["Meandarra State School",1473]
["Mena Creek State School",1673]
["Meridan State College",1733]
["Merinda State School",806]
["Meringandan State School",179]
["Merrimac State High School",2147]
["Merrimac State School",1586]
["Metro North Region - Nundah Office",9615]
["Metro South Region - Ipswich Office",7208]
["Metro South Region - Mt Gravatt Office",7215]
["Miallo State School",1291]
["Miami State High School",2086]
["Miami State School",1890]
["Middle Park State School",1969]
["Middle Ridge State School",414]
["Middlemount Community School",1905]
["Miles State High School",2144]
["Miles State School",341]
["Millaa Millaa State School",771]
["Millaroo State School",867]
["Millchester State School",157]
["Millmerran State School",176]
["Milman State School",1120]
["Milpera State High School",2024]
["Milton State School",551]
["Minden State School",294]
["Minimbah State School",265]
["Mirani State High School",2117]
["Mirani State School",658]
["Miriam Vale State School",792]
["Mirriwinni State School",1382]
["Mission Beach State School",1324]
["Mistake Creek State School",1919]
["Mitchell State School",27]
["Mitchelton Special School",3005]
["Mitchelton State High School",2040]
["Mitchelton State School",1538]
["Moffatdale State School",701]
["Moggill State School",73]
["Monkland State School",417]
["Monto State High School",2098]
["Monto State School",1831]
["Montville State School",776]
["Mooloolaba State School",1818]
["Mooloolah State School",309]
["Moonie State School",511]
["Moore Park Beach State School",1739]
["Moorooka State School",1637]
["Moranbah East State School",1908]
["Moranbah State High School",2135]
["Moranbah State School",896]
["Morayfield East State School",1985]
["Morayfield State High School",2154]
["Morayfield State School",125]
["Moreton Bay Environmental Education Centre",3567]
["Moreton Downs State School",1753]
["Morningside State School",1803]
["Mornington Island State School",291]
["Morven State School",525]
["Mossman State High School",2002]
["Mossman State School",167]
["Mount Alford State School",381]
["Mount Archer State School",1914]
["Mount Cotton State School",284]
["Mount Crosby State School",267]
["Mount Fox State School",1975]
["Mount Garnet State School",944]
["Mount Gravatt East State School",660]
["Mount Gravatt State High School",2056]
["Mount Gravatt State School",198]
["Mount Isa Central State School",1067]
["Mount Isa School of the Air",3604]
["Mount Isa Special School",3004]
["Mount Kilcoy State School",1166]
["Mount Larcom State School",300]
["Mount Marrow State School",1189]
["Mount Mee State School",690]
["Mount Molloy State School",1109]
["Mount Morgan Central State School",526]
["Mount Morgan State High School",2010]
["Mount Murchison State School",1511]
["Mount Nebo State School",737]
["Mount Ommaney Special School",3088]
["Mount Perry State School",75]
["Mount Samson State School",377]
["Mount Surprise State School",1531]
["Mount Sylvia State School",464]
["Mount Tarampa State School",1111]
["Mount Tyson State School",1037]
["Mount Warren Park State School",1906]
["Mount Whitestone State School",495]
["Mountain Creek State High School",2190]
["Mountain Creek State School",1999]
["Moura State High School",2136]
["Moura State School",932]
["Mourilyan State School",957]
["Mudgeeraba Creek State School",159]
["Mudgeeraba Special School",3049]
["Mudgeeraba State School",663]
["Mulgildie State School",1418]
["Mundingburra State School",436]
["Mundoo State School",722]
["Mundubbera State College",1420]
["Mungallala State School",507]
["Mungar State School",217]
["Murarrie State School",1469]
["Murgon State High School",2052]
["Murgon State School",871]
["Murphy's Creek State School",76]
["Murray River Upper State School",1030]
["Murray's Bridge State School",1177]
["Murrumba State Secondary College",7574]
["Musgrave Hill State School",1678]
["Mutarnee State School",1317]
["Mutchilba State School",993]
["Mutdapilly State School",152]
["Muttaburra State School",304]
["Nagoorin State School",1481]
["Nambour Special School",3039]
["Nambour State College",2031]
["Nambour State College - Junior School",363]
["Nanango State High School",2157]
["Nanango State School",77]
["Narangba State School",1200]
["Narangba Valley State High School",444]
["Narangba Valley State School",1725]
["Narbethong State Special School",3140]
["Nashville State School",479]
["Nebo State School",184]
["Nerang State High School",2169]
["Nerang State School",218]
["New Farm State School",943]
["Newmarket State School",228]
["Newtown State School",1227]
["Nirimba State Primary School","B018"]
["Nobby State School",1735]
["Noosa District State High School",2088]
["Noosa District State High School - Pomona Campus",2292]
["Noosaville State School",175]
["Norfolk Island Central School","B059"]
["Norfolk Village State School",1741]
["Norman Park State School",926]
["Normanton State School",360]
["Norris Road State School",1863]
["North Arm State School",469]
["North Coast Region - Bundaberg Office",6670]
["North Coast Region - Maroochydore Office",7586]
["North Coast Region - Maryborough Office",6671]
["North Coast Region - North Lakes Office",9923]
["North Eton State School",731]
["North Lakes State College",2324]
["North Queensland Region - Mount Isa Office",6646]
["North Queensland Region - Townsville Office",6644]
["North Rockhampton State High School",2041]
["North Shore State School","A069"]
["Northern Beaches State High School",211]
["Northern Peninsula Area College - Ama Mary Eseli Injinoo Campus",5704]
["Northern Peninsula Area College - Bamaga Junior Campus",5703]
["Northern Peninsula Area State College - Senior Campus",5971]
["Northgate State School",281]
["Northview State School",1957]
["Norville State School",445]
["Nudgee Beach Environmental Education Centre",3590]
["Numinbah Valley Environmental Education Centre",3558]
["Numinbah Valley State School",785]
["Nundah State School",43]
["Nursery Road State Special School",3084]
["Oakenden State School",1238]
["Oakey State High School",2099]
["Oakey State School",166]
["Oakleigh State School",331]
["Oakwood State School",620]
["One Mile State School",51]
["Oonoonba State School",556]
["Orion State School",1271]
["Ormeau State School",336]
["Ormeau Woods State High School",6136]
["Ormiston State School",23]
["Osborne State School",74]
["Oxenford State School",1970]
["Oxley State School",79]
["Pacific Paradise State School",1991]
["Pacific Pines State High School",1745]
["Pacific Pines State School",1744]
["Pallara State School",831]
["Palm Beach State School",240]
["Palm Beach-Currumbin State High School",2129]
["Palmview State Primary School","A907"]
["Palmview State Secondary College","A906"]
["Palmview State Special School","A905"]
["Palmwoods State School",592]
["Paluma Environmental Education Centre",3568]
["Park Avenue State School",983]
["Park Lake State School",5700]
["Park Ridge State High School",2187]
["Park Ridge State School",515]
["Parke State School",1467]
["Parkhurst State School",922]
["Parramatta State School",639]
["Patrick Estate State School",1486]
["Patricks Road State School",1864]
["Payne Road State School",286]
["Peachester State School",672]
["Peak Crossing State School",86]
["Pentland State School",467]
["Peregian Springs State School",1712]
["Petrie State School",183]
["Petrie Terrace State School",80]
["Pialba State School",419]
["Picnic Creek State School",9315]
["Pilton State School",422]
["Pimlico State High School",2049]
["Pimpama State Primary College",9331]
["Pimpama State School",81]
["Pimpama State Secondary College",8044]
["Pindi Pindi State School",1408]
["Pine Rivers Special School",3011]
["Pine Rivers State High School",2102]
["Pinnacle State School",1141]
["Pioneer State High School",2168]
["Pittsworth State High School",2119]
["Pittsworth State School",373]
["Pomona State School",720]
["Pormpuraaw State School",457]
["Port Curtis Road State School",208]
["Port Douglas State School",1979]
["Pozieres State School",1704]
["Prairie State School",488]
["Prenzlau State School",238]
["Proserpine State High School",2090]
["Proserpine State School",779]
["Prospect Creek State School",1655]
["Proston State School",1155]
["Pullenvale Environmental Education Centre",3565]
["Pullenvale State School",140]
["Pumicestone State School",9324]
["QRSS Peninsula Regional School Sport",2275]
["Queens Beach State School",1194]
["Queensland Academy for Creative Industries",5685]
["Queensland Academy for Health Sciences",5727]
["Queensland Academy for Science Mathematics and Technology",5684]
["Queensland Children's Hospital School",3102]
["Queensland Pathways State College - Bracken Ridge Campus","A085"]
["Queensland Pathways State College - Bundamba Campus","A070"]
["Queensland Pathways State College - Goodna Campus",9956]
["Queensland Pathways State College - Inner City Campus","A653"]
["Queensland Pathways State College - Mt Gravatt Campus",9199]
["Queensland Pathways State College - Townsville Campus","A104"]
["Quilpie State College",1594]
["Quinalow Prep-10 State School",958]
["Raceview State School",975]
["Railway Estate State School",1530]
["Rainbow Beach State School",1955]
["Rainworth State School",1491]
["Ramsay State School",29]
["Rangeville State School",1174]
["Rasmussen State School",1870]
["Rathdowney State School",1332]
["Ravenshoe State School - Junior Campus",6147]
["Ravenshoe State School - Senior Campus",6148]
["Ravenswood State School",141]
["Red Hill Special School",3085]
["Red Hill Special School - Ithaca Campus","A652"]
["Redbank Plains State High School",2174]
["Redbank Plains State School",88]
["Redbank State School",719]
["Redcliffe Special School",3009]
["Redcliffe State High School",2045]
["Redland Bay State School",229]
["Redland District Special School",3033]
["Redlynch State College",1336]
["Regents Park State School",1996]
["Richlands East State School",721]
["Richmond Hill State School",733]
["Richmond State School",576]
["Ridgelands State School",1489]
["Ripley Central State School","B118"]
["Ripley Valley State School","A790"]
["Ripley Valley State Secondary College","A797"]
["Riverview State School",1865]
["Roadvale State School",582]
["Robertson State School",1899]
["Robina State High School",195]
["Robina State School",1982]
["Rochedale South State School",1886]
["Rochedale State High School",2158]
["Rochedale State School",1638]
["Rockhampton North Special School",3038]
["Rockhampton Special School",3010]
["Rockhampton State High School",2011]
["Rocklea State School",454]
["Rockville State School",1786]
["Rolleston State School",92]
["Rollingstone State School",1325]
["Roma State College",5666]
["Rosedale State School",759]
["Rosella Park School",3002]
["Rosewood State High School",2151]
["Rosewood State School",131]
["Rossville State School",1977]
["Runaway Bay Sport and Leadership Excellence Centre",7192]
["Runcorn Heights State School",472]
["Runcorn State High School",2167]
["Runcorn State School",968]
["Russell Island State School",1488]
["Salisbury State School",1690]
["Samford State School",94]
["Sandgate District State High School",2047]
["Sandgate State School",153]
["Sandy Strait State School",1754]
["Sarina State High School",2101]
["Sarina State School",546]
["Scarborough State School",1560]
["Scottville State School",475]
["Seaforth State School",1479]
["Serviceton South State School",590]
["Seven Hills State School",1026]
["Severnlea State School",1007]
["Seville Road State School",1131]
["Shailer Park State High School",2149]
["Shailer Park State School",1916]
["Sharon State School",400]
["Sherwood State School",78]
["Shorncliffe State School",1623]
["Silkstone State School",247]
["Silkwood State School",1528]
["Slade Point State School",1853]
["Somerset Hills State School",692]
["South Johnstone State School",1518]
["South Rock State School","B119"]
["Southbrook Central State School",1241]
["Southport Special School",3026]
["Southport State High School",2037]
["Southport State School",368]
["Spinifex State College - Mount Isa - Junior Campus",5149]
["Spinifex State College - Mount Isa - Senior Campus",5148]
["Spinifex State College - Mount Isa - Student Residential",5151]
["Spring Mountain State School","A657"]
["Springbrook State School",1931]
["Springfield Central State High School",7131]
["Springfield Central State School",7123]
["Springfield Lakes State School",5556]
["Springsure State School",102]
["Springwood Central State School",1869]
["Springwood Road State School",358]
["Springwood State High School",2140]
["St Bernard State School",1425]
["St George State High School",2143]
["St George State School",134]
["St Helens State School",236]
["St Lawrence State School",103]
["Stafford Heights State School",1016]
["Stafford State School",487]
["Stanley River Environmental Education Centre",3551]
["Stanthorpe State High School",2064]
["Stanthorpe State School",132]
["Stanwell State School",129]
["Stonehenge State School",933]
["Strathpine State School",1245]
["Strathpine West State School",1910]
["Stretton State College",5554]
["Sunbury State School",622]
["Sunnybank Hills State School",1889]
["Sunnybank Special School",3078]
["Sunnybank State High School",2080]
["Sunnybank State School",62]
["Sunset State School",965]
["Sunshine Beach State High School",2108]
["Sunshine Beach State School",1917]
["Sunshine Coast Environmental Education Centre",3580]
["Surat State School",142]
["Surfers Paradise State School",1295]
["Swayneville State School",1595]
["Taabinga State School",1096]
["Tagai State College",5726]
["Tagai State College - Badu Island Campus",1940]
["Tagai State College - Darnley Island Campus",1944]
["Tagai State College - Dauan Island Campus",1950]
["Tagai State College - Horn Island Campus",1995]
["Tagai State College - Kubin Campus",1949]
["Tagai State College - Mabuiag Island Campus",1942]
["Tagai State College - Malu Kiwai Campus",1941]
["Tagai State College - Mer Campus",1943]
["Tagai State College - Poruma Campus",1951]
["Tagai State College - Saibai Island Campus",1946]
["Tagai State College - St Pauls Campus",1953]
["Tagai State College - Stephen Island Campus",1952]
["Tagai State College - Thursday Island Primary Campus",463]
["Tagai State College - Thursday Island Secondary",2114]
["Tagai State College - Warraber Island Campus",1948]
["Tagai State College - Yam Island Campus",1947]
["Tagai State College - Yorke Island Campus",1945]
["Taigum State School",1112]
["Talara Primary College",462]
["Tallebudgera Outdoor and Environmental Education Centre",3555]
["Tallebudgera State School",201]
["Talwood State School",1615]
["Tambo State School",150]
["Tamborine Mountain State High School",2265]
["Tamborine Mountain State School",913]
["Tamrookum State School",1252]
["Tanduringie State School",1446]
["Tannum Sands State High School",231]
["Tannum Sands State School",1921]
["Tara Shire State College",1357]
["Tarampa State School",271]
["Taranganba State School",1992]
["Taroom State School",105]
["Teelba State School",494]
["Tent Hill Lower State School",106]
["Tewantin State School",181]
["Texas P-10 State School",437]
["Thabeban State School",1573]
["Thallon State School",1278]
["Thangool State School",1840]
["Thargomindah State School",409]
["The Caves State School",1018]
["The Gap State High School",2053]
["The Gap State School",1302]
["The Gums State School",1360]
["The Hall State School",1195]
["The Summit State School",1714]
["The Willows State School",287]
["Theebine State School",579]
["Theodore State School",676]
["Thornlands State School",1240]
["Thornton State School",245]
["Thulimbah State School",803]
["Thuringowa State High School",2172]
["Tiaro State School",107]
["Tieri State School",1926]
["Tin Can Bay State School",577]
["Tinana State School",216]
["Tinaroo Environmental Education Centre",3583]
["Tingalpa State School",127]
["Tingoora State School",864]
["Tivoli State School",224]
["Tolga State School",629]
["Toobanna State School",1777]
["Toogoolawah State High School",2179]
["Toogoolawah State School",1069]
["Toohey Forest Environmental Education Centre",2260]
["Toolooa State High School",2152]
["Toowong State School",13]
["Toowoomba East State School",499]
["Toowoomba North State School",110]
["Toowoomba State High School",2013]
["Toowoomba West Special School",3032]
["Torbanlea State School",522]
["Torquay State School",945]
["Townsville Central State School",113]
["Townsville Community Learning Centre - A State Special School",2376]
["Townsville South State School",303]
["Townsville State High School",2100]
["Townsville West State School",498]
["Townview State School",1203]
["Trebonne State School",1118]
["Trinity Bay State High School",2057]
["Tropical North Learning Academy - Smithfield State High School",2159]
["Tropical North Learning Academy - Trinity Beach State School",1893]
["Tullawong State High School",2188]
["Tullawong State School",1994]
["Tully State High School",2103]
["Tully State School",1008]
["Two Mile State School",361]
["Undurba State School",1877]
["Upper Brookfield State School",1501]
["Upper Coomera State College",2340]
["Upper Mount Gravatt State School",128]
["Urandangi State School",1755]
["Urangan Point State School",1536]
["Urangan State High School",2110]
["Vale View State School",844]
["Valkyrie State School",403]
["Varsity College",1759]
["Veresdale Scrub State School",869]
["Victoria Park State School",1855]
["Victoria Plantation State School",628]
["Victoria Point State High School",234]
["Victoria Point State School",1512]
["Vienna Woods State School",1936]
["Vincent State School",948]
["Virginia State School",1675]
["Walkamin State School",760]
["Walkerston State School",353]
["Walkervale State School",536]
["Wallangarra State School",458]
["Wallaville State School",1192]
["Walloon State School",285]
["Wallumbilla State School",182]
["Wamuran State School",1724]
["Wandoan State School P-10",1296]
["Waraburra State School",1971]
["Warra State School",386]
["Warrigal Road State School",1885]
["Warrill View State School",1230]
["Wartburg State School",1159]
["Warwick Central State School",116]
["Warwick East State School",225]
["Warwick State High School",2015]
["Warwick West State School",1152]
["Waterford State School",130]
["Waterford West State School",1856]
["Watson Road State School",584]
["Wavell Heights State School",1149]
["Wavell State High School",2048]
["Weir State School",395]
["Wellcamp State School",855]
["Wellers Hill State School",1844]
["Wellington Point State High School",2178]
["Wellington Point State School",273]
["West End State School",212]
["Western Cape College - Mapoon",82]
["Western Cape College - Weipa",1407]
["Western Cape College Residential Centre",8014]
["Western Suburbs State Special School",3014]
["Westmar State School",1244]
["Westwood State School",119]
["Wheatlands State School",1405]
["Wheatvale State School",1147]
["White Rock State School",1978]
["Whites Hill State College",2410]
["Whitfield State School",1980]
["Widgee State School",669]
["William Duncan State School",1972]
["William Ross State High School",2186]
["Wilsonton State High School",468]
["Wilsonton State School",394]
["Wilston State School",1485]
["Windaroo State School",1990]
["Windaroo Valley State High School",2189]
["Windera State School",292]
["Windorah State School",461]
["Windsor State School",11]
["Winton State School",478]
["Wishart State School",633]
["Withcott State School",1930]
["Wolvi State School",881]
["Wondai State School",1065]
["Wondall Heights State School",416]
["Wonga Beach State School",1614]
["Woodcrest State College",456]
["Woodford State School",370]
["Woodhill State School",122]
["WoodLinks State School",7121]
["Woodridge North State School",647]
["Woodridge State High School",2128]
["Woodridge State School",704]
["Woodstock State School",615]
["Woody Point Special School",3042]
["Woogaroo Creek State School","A918"]
["Woolooga State School",1378]
["Wooloowin State School",1463]
["Woombye State School",476]
["Woongarra State School",350]
["Woongoolba State School",39]
["Woorabinda State School",617]
["Wooroolin State School",947]
["Woree State High School",2162]
["Woree State School",1902]
["Worongary State School",1993]
["Wowan State School",919]
["Wulguru State School",547]
["Wyandra State School",802]
["Wynnum State High School",2021]
["Wynnum State School",6981]
["Wynnum West State School",1765]
["Wyreema State School",524]
["Yandaran State School",1634]
["Yandina State School",491]
["Yangan State School",151]
["Yarrabah State School - Kindergarten Campus",6129]
["Yarrabah State School - Primary Campus",6127]
["Yarrabah State School - Secondary Campus",6128]
["Yarrabilba State School","A068"]
["Yarrabilba State Secondary College","A789"]
["Yarraman State School",967]
["Yarrilee State School",1746]
["Yarwun State School",1098]
["Yelarbon State School",1346]
["Yeppoon State High School",2123]
["Yeppoon State School",442]
["Yeronga State High School",2054]
["Yeronga State School",8]
["Yorkeys Knob State School",757]
["Yugumbir State School",1954]
["Yuleba State School",372]
["Yungaburra State School",1002]
["Zillmere State School",275]

{"sheet":"Workplace_Lookup","index":20,"n_rows":1370,"n_cols":7,"rows_kept":1370,"cut":false,"hidden":true,"merged":[]}
["Centre Code","Centre Name","Search Check","ListSize","My_List"]
[591,"Abercorn State School",{"$f":"IF(ISERROR(SEARCH(Workplace_Name,Workplace_Lookup!B2)),0,1)","v":1},{"$f":"IF(C2=0,\"\",COUNTIF($B$2:C2,1))","v":1},{"$f":"IFERROR(INDEX(B:B,MATCH(ROW(B1),D:D,0)),\"\")","v":"Abercorn State School"},null,"School/Centre"]
[1275,"Abergowrie State School",{"$f":"IF(ISERROR(SEARCH(Workplace_Name,Workplace_Lookup!B3)),0,1)","v":1},{"$f":"IF(C3=0,\"\",COUNTIF($B$2:C3,1))","v":2},{"$f":"IFERROR(INDEX(B:B,MATCH(ROW(B2),D:D,0)),\"\")","v":"Abergowrie State School"}]
[25,"Acacia Ridge State School",{"$f":"IF(ISERROR(SEARCH(Workplace_Name,Workplace_Lookup!B4)),0,1)","v":1},{"$f":"IF(C4=0,\"\",COUNTIF($B$2:C4,1))","v":3},{"$f":"IFERROR(INDEX(B:B,MATCH(ROW(B3),D:D,0)),\"\")","v":"Acacia Ridge State School"}]
[1983,"Agnes Water State School",{"$f":"IF(ISERROR(SEARCH(Workplace_Name,Workplace_Lookup!B5)),0,1)","v":1},{"$f":"IF(C5=0,\"\",COUNTIF($B$2:C5,1))","v":4},"Agnes Water State School"]
[598,"Airville State School",{"$f":"IF(ISERROR(SEARCH(Workplace_Name,Workplace_Lookup!B6)),0,1)","v":1},{"$f":"IF(C6=0,\"\",COUNTIF($B$2:C6,1))","v":5},"Airville State School"]
[801,"Aitkenvale State School",{"$f":"IF(ISERROR(SEARCH(Workplace_Name,Workplace_Lookup!B7)),0,1)","v":1},{"$f":"IF(C7=0,\"\",COUNTIF($B$2:C7,1))","v":6},"Aitkenvale State School"]
[2155,"Albany Creek State High School",{"$f":"IF(ISERROR(SEARCH(Workplace_Name,Workplace_Lookup!B8)),0,1)","v":1},{"$f":"IF(C8=0,\"\",COUNTIF($B$2:C8,1))","v":7},"Albany Creek State High School"]
[190,"Albany Creek State School",{"$f":"IF(ISERROR(SEARCH(Workplace_Name,Workplace_Lookup!B9)),0,1)","v":1},{"$f":"IF(C9=0,\"\",COUNTIF($B$2:C9,1))","v":8},"Albany Creek State School"]
[1892,"Albany Hills State School",{"$f":"IF(ISERROR(SEARCH(Workplace_Name,Workplace_Lookup!B10)),0,1)","v":1},{"$f":"IF(C10=0,\"\",COUNTIF($B$2:C10,1))","v":9},"Albany Hills State School"]
[38,"Albert State School",{"$f":"IF(ISERROR(SEARCH(Workplace_Name,Workplace_Lookup!B11)),0,1)","v":1},{"$f":"IF(C11=0,\"\",COUNTIF($B$2:C11,1))","v":10},"Albert State School"]
[2017,"Aldridge State High School",{"$f":"IF(ISERROR(SEARCH(Workplace_Name,Workplace_Lookup!B12)),0,1)","v":1},{"$f":"IF(C12=0,\"\",COUNTIF($B$2:C12,1))","v":11},"Aldridge State High School"]
[1963,"Alexandra Bay State School",{"$f":"IF(ISERROR(SEARCH(Workplace_Name,Workplace_Lookup!B13)),0,1)","v":1},{"$f":"IF(C13=0,\"\",COUNTIF($B$2:C13,1))","v":12},"Alexandra Bay State School"]
[2175,"Alexandra Hills State High School",{"$f":"IF(ISERROR(SEARCH(Workplace_Name,Workplace_Lookup!B14)),0,1)","v":1},{"$f":"IF(C14=0,\"\",COUNTIF($B$2:C14,1))","v":13},"Alexandra Hills State High School"]
[405,"Alexandra Hills State School",{"$f":"IF(ISERROR(SEARCH(Workplace_Name,Workplace_Lookup!B15)),0,1)","v":1},{"$f":"IF(C15=0,\"\",COUNTIF($B$2:C15,1))","v":14},"Alexandra Hills State School"]
[1866,"Algester State School",{"$f":"IF(ISERROR(SEARCH(Workplace_Name,Workplace_Lookup!B16)),0,1)","v":1},{"$f":"IF(C16=0,\"\",COUNTIF($B$2:C16,1))","v":15},"Algester State School"]
[155,"Allenstown State School",{"$f":"IF(ISERROR(SEARCH(Workplace_Name,Workplace_Lookup!B17)),0,1)","v":1},{"$f":"IF(C17=0,\"\",COUNTIF($B$2:C17,1))","v":16},"Allenstown State School"]
[773,"Alligator Creek State School",{"$f":"IF(ISERROR(SEARCH(Workplace_Name,Workplace_Lookup!B18)),0,1)","v":1},{"$f":"IF(C18=0,\"\",COUNTIF($B$2:C18,1))","v":17},"Alligator Creek State School"]
[3,"Allora P-10 State School",{"$f":"IF(ISERROR(SEARCH(Workplace_Name,Workplace_Lookup!B19)),0,1)","v":1},{"$f":"IF(C19=0,\"\",COUNTIF($B$2:C19,1))","v":18},"Allora P-10 State School"]
[430,"Alloway State School",{"$f":"IF(ISERROR(SEARCH(Workplace_Name,Workplace_Lookup!B20)),0,1)","v":1},{"$f":"IF(C20=0,\"\",COUNTIF($B$2:C20,1))","v":19},"Alloway State School"]
[870,"Aloomba State School",{"$f":"IF(ISERROR(SEARCH(Workplace_Name,Workplace_Lookup!B21)),0,1)","v":1},{"$f":"IF(C21=0,\"\",COUNTIF($B$2:C21,1))","v":20},"Aloomba State School"]
[517,"Alpha State School",{"$f":"IF(ISERROR(SEARCH(Workplace_Name,Workplace_Lookup!B22)),0,1)","v":1},{"$f":"IF(C22=0,\"\",COUNTIF($B$2:C22,1))","v":21},"Alpha State School"]
[1719,"Amamoor State School",{"$f":"IF(ISERROR(SEARCH(Workplace_Name,Workplace_Lookup!B23)),0,1)","v":1},{"$f":"IF(C23=0,\"\",COUNTIF($B$2:C23,1))","v":22},"Amamoor State School"]
[3553,"Amaroo Environmental Education Centre",{"$f":"IF(ISERROR(SEARCH(Workplace_Name,Workplace_Lookup!B24)),0,1)","v":1},{"$f":"IF(C24=0,\"\",COUNTIF($B$2:C24,1))","v":23},"Amaroo Environmental Education Centre"]
[115,"Amberley District State School",{"$f":"IF(ISERROR(SEARCH(Workplace_Name,Workplace_Lookup!B25)),0,1)","v":1},{"$f":"IF(C25=0,\"\",COUNTIF($B$2:C25,1))","v":24},"Amberley District State School"]
[1415,"Ambrose State School",{"$f":"IF(ISERROR(SEARCH(Workplace_Name,Workplace_Lookup!B26)),0,1)","v":1},{"$f":"IF(C26=0,\"\",COUNTIF($B$2:C26,1))","v":25},"Ambrose State School"]
[1629,"Amiens State School",{"$f":"IF(ISERROR(SEARCH(Workplace_Name,Workplace_Lookup!B27)),0,1)","v":1},{"$f":"IF(C27=0,\"\",COUNTIF($B$2:C27,1))","v":26},"Amiens State School"]
[474,"Anakie State School",{"$f":"IF(ISERROR(SEARCH(Workplace_Name,Workplace_Lookup!B28)),0,1)","v":1},{"$f":"IF(C28=0,\"\",COUNTIF($B$2:C28,1))","v":27},"Anakie State School"]
[1572,"Andergrove State School",{"$f":"IF(ISERROR(SEARCH(Workplace_Name,Workplace_Lookup!B29)),0,1)","v":1},{"$f":"IF(C29=0,\"\",COUNTIF($B$2:C29,1))","v":28},"Andergrove State School"]
[440,"Annandale State School",{"$f":"IF(ISERROR(SEARCH(Workplace_Name,Workplace_Lookup!B30)),0,1)","v":1},{"$f":"IF(C30=0,\"\",COUNTIF($B$2:C30,1))","v":29},"Annandale State School"]
[1294,"Applethorpe State School",{"$f":"IF(ISERROR(SEARCH(Workplace_Name,Workplace_Lookup!B31)),0,1)","v":1},{"$f":"IF(C31=0,\"\",COUNTIF($B$2:C31,1))","v":30},"Applethorpe State School"]
[312,"Aramac State School",{"$f":"IF(ISERROR(SEARCH(Workplace_Name,Workplace_Lookup!B32)),0,1)","v":1},{"$f":"IF(C32=0,\"\",COUNTIF($B$2:C32,1))","v":31},"Aramac State School"]
[1266,"Aratula State School",{"$f":"IF(ISERROR(SEARCH(Workplace_Name,Workplace_Lookup!B33)),0,1)","v":1},{"$f":"IF(C33=0,\"\",COUNTIF($B$2:C33,1))","v":32},"Aratula State School"]
[813,"Arcadia Valley State School",{"$f":"IF(ISERROR(SEARCH(Workplace_Name,Workplace_Lookup!B34)),0,1)","v":1},{"$f":"IF(C34=0,\"\",COUNTIF($B$2:C34,1))","v":33},"Arcadia Valley State School"]
[1997,"Arundel State School",{"$f":"IF(ISERROR(SEARCH(Workplace_Name,Workplace_Lookup!B35)),0,1)","v":1},{"$f":"IF(C35=0,\"\",COUNTIF($B$2:C35,1))","v":34},"Arundel State School"]
[296,"Ascot State School",{"$f":"IF(ISERROR(SEARCH(Workplace_Name,Workplace_Lookup!B36)),0,1)","v":1},{"$f":"IF(C36=0,\"\",COUNTIF($B$2:C36,1))","v":35},"Ascot State School"]
[186,"Ashgrove State School",{"$f":"IF(ISERROR(SEARCH(Workplace_Name,Workplace_Lookup!B37)),0,1)","v":1},{"$f":"IF(C37=0,\"\",COUNTIF($B$2:C37,1))","v":36},"Ashgrove State School"]
[1871,"Ashmore State School",{"$f":"IF(ISERROR(SEARCH(Workplace_Name,Workplace_Lookup!B38)),0,1)","v":1},{"$f":"IF(C38=0,\"\",COUNTIF($B$2:C38,1))","v":37},"Ashmore State School"]
[512,"Ashwell State School",{"$f":"IF(ISERROR(SEARCH(Workplace_Name,Workplace_Lookup!B39)),0,1)","v":1},{"$f":"IF(C39=0,\"\",COUNTIF($B$2:C39,1))","v":38},"Ashwell State School"]
[1004,"Aspley East State School",{"$f":"IF(ISERROR(SEARCH(Workplace_Name,Workplace_Lookup!B40)),0,1)","v":1},{"$f":"IF(C40=0,\"\",COUNTIF($B$2:C40,1))","v":39},"Aspley East State School"]
[3031,"Aspley Special School",{"$f":"IF(ISERROR(SEARCH(Workplace_Name,Workplace_Lookup!B41)),0,1)","v":1},{"$f":"IF(C41=0,\"\",COUNTIF($B$2:C41,1))","v":40},"Aspley Special School"]
[2076,"Aspley State High School",{"$f":"IF(ISERROR(SEARCH(Workplace_Name,Workplace_Lookup!B42)),0,1)","v":1},{"$f":"IF(C42=0,\"\",COUNTIF($B$2:C42,1))","v":41},"Aspley State High School"]
[610,"Aspley State School",{"$f":"IF(ISERROR(SEARCH(Workplace_Name,Workplace_Lookup!B43)),0,1)","v":1},{"$f":"IF(C43=0,\"\",COUNTIF($B$2:C43,1))","v":42},"Aspley State School"]
[2051,"Atherton State High School",{"$f":"IF(ISERROR(SEARCH(Workplace_Name,Workplace_Lookup!B44)),0,1)","v":1},{"$f":"IF(C44=0,\"\",COUNTIF($B$2:C44,1))","v":43},"Atherton State High School"]
[789,"Atherton State School",{"$f":"IF(ISERROR(SEARCH(Workplace_Name,Workplace_Lookup!B45)),0,1)","v":1},{"$f":"IF(C45=0,\"\",COUNTIF($B$2:C45,1))","v":44},"Atherton State School"]
[357,"Augathella State School",{"$f":"IF(ISERROR(SEARCH(Workplace_Name,Workplace_Lookup!B46)),0,1)","v":1},{"$f":"IF(C46=0,\"\",COUNTIF($B$2:C46,1))","v":45},"Augathella State School"]
[7120,"Augusta State School",{"$f":"IF(ISERROR(SEARCH(Workplace_Name,Workplace_Lookup!B47)),0,1)","v":1},{"$f":"IF(C47=0,\"\",COUNTIF($B$2:C47,1))","v":46},"Augusta State School"]
[274,"Aurukun State School",{"$f":"IF(ISERROR(SEARCH(Workplace_Name,Workplace_Lookup!B48)),0,1)","v":1},{"$f":"IF(C48=0,\"\",COUNTIF($B$2:C48,1))","v":47},"Aurukun State School"]
[2078,"Aviation High",{"$f":"IF(ISERROR(SEARCH(Workplace_Name,Workplace_Lookup!B49)),0,1)","v":1},{"$f":"IF(C49=0,\"\",COUNTIF($B$2:C49,1))","v":48},"Aviation High"]
[1901,"Avoca State School",{"$f":"IF(ISERROR(SEARCH(Workplace_Name,Workplace_Lookup!B50)),0,1)","v":1},{"$f":"IF(C50=0,\"\",COUNTIF($B$2:C50,1))","v":49},"Avoca State School"]
[572,"Avondale State School",{"$f":"IF(ISERROR(SEARCH(Workplace_Name,Workplace_Lookup!B51)),0,1)","v":1},{"$f":"IF(C51=0,\"\",COUNTIF($B$2:C51,1))","v":50},"Avondale State School"]
[2008,"Ayr State High School",{"$f":"IF(ISERROR(SEARCH(Workplace_Name,Workplace_Lookup!B52)),0,1)","v":1},{"$f":"IF(C52=0,\"\",COUNTIF($B$2:C52,1))","v":51},"Ayr State High School"]
[451,"Ayr State School",{"$f":"IF(ISERROR(SEARCH(Workplace_Name,Workplace_Lookup!B53)),0,1)","v":1},{"$f":"IF(C53=0,\"\",COUNTIF($B$2:C53,1))","v":52},"Ayr State School"]
[1466,"Babinda State School",{"$f":"IF(ISERROR(SEARCH(Workplace_Name,Workplace_Lookup!B54)),0,1)","v":1},{"$f":"IF(C54=0,\"\",COUNTIF($B$2:C54,1))","v":53},"Babinda State School"]
[317,"Back Plains State School",{"$f":"IF(ISERROR(SEARCH(Workplace_Name,Workplace_Lookup!B55)),0,1)","v":1},{"$f":"IF(C55=0,\"\",COUNTIF($B$2:C55,1))","v":54},"Back Plains State School"]
[906,"Bajool State School",{"$f":"IF(ISERROR(SEARCH(Workplace_Name,Workplace_Lookup!B56)),0,1)","v":1},{"$f":"IF(C56=0,\"\",COUNTIF($B$2:C56,1))","v":55},"Bajool State School"]
[1689,"Balaclava State School",{"$f":"IF(ISERROR(SEARCH(Workplace_Name,Workplace_Lookup!B57)),0,1)","v":1},{"$f":"IF(C57=0,\"\",COUNTIF($B$2:C57,1))","v":56},"Balaclava State School"]
[4,"Bald Hills State School",{"$f":"IF(ISERROR(SEARCH(Workplace_Name,Workplace_Lookup!B58)),0,1)","v":1},{"$f":"IF(C58=0,\"\",COUNTIF($B$2:C58,1))","v":57},"Bald Hills State School"]
[1164,"Ballandean State School",{"$f":"IF(ISERROR(SEARCH(Workplace_Name,Workplace_Lookup!B59)),0,1)","v":1},{"$f":"IF(C59=0,\"\",COUNTIF($B$2:C59,1))","v":58},"Ballandean State School"]
[2043,"Balmoral State High School",{"$f":"IF(ISERROR(SEARCH(Workplace_Name,Workplace_Lookup!B60)),0,1)","v":1},{"$f":"IF(C60=0,\"\",COUNTIF($B$2:C60,1))","v":59},"Balmoral State High School"]
[521,"Banana State School",{"$f":"IF(ISERROR(SEARCH(Workplace_Name,Workplace_Lookup!B61)),0,1)","v":1},{"$f":"IF(C61=0,\"\",COUNTIF($B$2:C61,1))","v":60},"Banana State School"]
[1989,"Banksia Beach State School",{"$f":"IF(ISERROR(SEARCH(Workplace_Name,Workplace_Lookup!B62)),0,1)","v":1},{"$f":"IF(C62=0,\"\",COUNTIF($B$2:C62,1))","v":61},"Banksia Beach State School"]
[1605,"Baralaba State School",{"$f":"IF(ISERROR(SEARCH(Workplace_Name,Workplace_Lookup!B63)),0,1)","v":1},{"$f":"IF(C63=0,\"\",COUNTIF($B$2:C63,1))","v":62},"Baralaba State School"]
[3562,"Barambah Environmental Education Centre",{"$f":"IF(ISERROR(SEARCH(Workplace_Name,Workplace_Lookup!B64)),0,1)","v":1},{"$f":"IF(C64=0,\"\",COUNTIF($B$2:C64,1))","v":63},"Barambah Environmental Education Centre"]
[531,"Barcaldine Prep-12 State School",{"$f":"IF(ISERROR(SEARCH(Workplace_Name,Workplace_Lookup!B65)),0,1)","v":1},{"$f":"IF(C65=0,\"\",COUNTIF($B$2:C65,1))","v":64},"Barcaldine Prep-12 State School"]
[1041,"Bardon State School",{"$f":"IF(ISERROR(SEARCH(Workplace_Name,Workplace_Lookup!B66)),0,1)","v":1},{"$f":"IF(C66=0,\"\",COUNTIF($B$2:C66,1))","v":65},"Bardon State School"]
[702,"Bargara State School",{"$f":"IF(ISERROR(SEARCH(Workplace_Name,Workplace_Lookup!B67)),0,1)","v":1},{"$f":"IF(C67=0,\"\",COUNTIF($B$2:C67,1))","v":66},"Bargara State School"]
["A109","Baringa State Primary School",{"$f":"IF(ISERROR(SEARCH(Workplace_Name,Workplace_Lookup!B68)),0,1)","v":1},{"$f":"IF(C68=0,\"\",COUNTIF($B$2:C68,1))","v":67},{"$f":"IFERROR(INDEX(B:B,MATCH(ROW(B67),D:D,0)),\"\")","v":"Baringa State Primary School"}]
["A908","Baringa State Secondary College",{"$f":"IF(ISERROR(SEARCH(Workplace_Name,Workplace_Lookup!B69)),0,1)","v":1},{"$f":"IF(C69=0,\"\",COUNTIF($B$2:C69,1))","v":68},"Baringa State Secondary College"]
[777,"Barkly Highway State School",{"$f":"IF(ISERROR(SEARCH(Workplace_Name,Workplace_Lookup!B70)),0,1)","v":1},{"$f":"IF(C70=0,\"\",COUNTIF($B$2:C70,1))","v":69},"Barkly Highway State School"]
[3056,"Barrett Adolescent Centre Special School",{"$f":"IF(ISERROR(SEARCH(Workplace_Name,Workplace_Lookup!B71)),0,1)","v":1},{"$f":"IF(C71=0,\"\",COUNTIF($B$2:C71,1))","v":70},"Barrett Adolescent Centre Special School"]
[1730,"Bartle Frere State School",{"$f":"IF(ISERROR(SEARCH(Workplace_Name,Workplace_Lookup!B72)),0,1)","v":1},{"$f":"IF(C72=0,\"\",COUNTIF($B$2:C72,1))","v":71},"Bartle Frere State School"]
[387,"Bauhinia State School",{"$f":"IF(ISERROR(SEARCH(Workplace_Name,Workplace_Lookup!B73)),0,1)","v":1},{"$f":"IF(C73=0,\"\",COUNTIF($B$2:C73,1))","v":72},"Bauhinia State School"]
[966,"Bauple State School",{"$f":"IF(ISERROR(SEARCH(Workplace_Name,Workplace_Lookup!B74)),0,1)","v":1},{"$f":"IF(C74=0,\"\",COUNTIF($B$2:C74,1))","v":73},"Bauple State School"]
[1798,"Bay View State School",{"$f":"IF(ISERROR(SEARCH(Workplace_Name,Workplace_Lookup!B75)),0,1)","v":1},{"$f":"IF(C75=0,\"\",COUNTIF($B$2:C75,1))","v":74},"Bay View State School"]
[1961,"Beachmere State School",{"$f":"IF(ISERROR(SEARCH(Workplace_Name,Workplace_Lookup!B76)),0,1)","v":1},{"$f":"IF(C76=0,\"\",COUNTIF($B$2:C76,1))","v":75},"Beachmere State School"]
[1672,"Beaconsfield State School",{"$f":"IF(ISERROR(SEARCH(Workplace_Name,Workplace_Lookup!B77)),0,1)","v":1},{"$f":"IF(C77=0,\"\",COUNTIF($B$2:C77,1))","v":76},"Beaconsfield State School"]
[2083,"Beaudesert State High School",{"$f":"IF(ISERROR(SEARCH(Workplace_Name,Workplace_Lookup!B78)),0,1)","v":1},{"$f":"IF(C78=0,\"\",COUNTIF($B$2:C78,1))","v":77},"Beaudesert State High School"]
[158,"Beaudesert State School",{"$f":"IF(ISERROR(SEARCH(Workplace_Name,Workplace_Lookup!B79)),0,1)","v":1},{"$f":"IF(C79=0,\"\",COUNTIF($B$2:C79,1))","v":78},"Beaudesert State School"]
[1019,"Bedourie State School",{"$f":"IF(ISERROR(SEARCH(Workplace_Name,Workplace_Lookup!B80)),0,1)","v":1},{"$f":"IF(C80=0,\"\",COUNTIF($B$2:C80,1))","v":79},"Bedourie State School"]
[681,"Beechmont State School",{"$f":"IF(ISERROR(SEARCH(Workplace_Name,Workplace_Lookup!B81)),0,1)","v":1},{"$f":"IF(C81=0,\"\",COUNTIF($B$2:C81,1))","v":80},"Beechmont State School"]
[3051,"Beenleigh Special School",{"$f":"IF(ISERROR(SEARCH(Workplace_Name,Workplace_Lookup!B82)),0,1)","v":1},{"$f":"IF(C82=0,\"\",COUNTIF($B$2:C82,1))","v":81},"Beenleigh Special School"]
[2084,"Beenleigh State High School",{"$f":"IF(ISERROR(SEARCH(Workplace_Name,Workplace_Lookup!B83)),0,1)","v":1},{"$f":"IF(C83=0,\"\",COUNTIF($B$2:C83,1))","v":82},"Beenleigh State High School"]
[6,"Beenleigh State School",{"$f":"IF(ISERROR(SEARCH(Workplace_Name,Workplace_Lookup!B84)),0,1)","v":1},{"$f":"IF(C84=0,\"\",COUNTIF($B$2:C84,1))","v":83},"Beenleigh State School"]
[1598,"Beerburrum State School",{"$f":"IF(ISERROR(SEARCH(Workplace_Name,Workplace_Lookup!B85)),0,1)","v":1},{"$f":"IF(C85=0,\"\",COUNTIF($B$2:C85,1))","v":84},"Beerburrum State School"]
[2109,"Beerwah State High School",{"$f":"IF(ISERROR(SEARCH(Workplace_Name,Workplace_Lookup!B86)),0,1)","v":1},{"$f":"IF(C86=0,\"\",COUNTIF($B$2:C86,1))","v":85},"Beerwah State High School"]
[569,"Beerwah State School",{"$f":"IF(ISERROR(SEARCH(Workplace_Name,Workplace_Lookup!B87)),0,1)","v":1},{"$f":"IF(C87=0,\"\",COUNTIF($B$2:C87,1))","v":86},"Beerwah State School"]
[187,"Begonia State School",{"$f":"IF(ISERROR(SEARCH(Workplace_Name,Workplace_Lookup!B88)),0,1)","v":1},{"$f":"IF(C88=0,\"\",COUNTIF($B$2:C88,1))","v":87},"Begonia State School"]
[509,"Belgian Gardens State School",{"$f":"IF(ISERROR(SEARCH(Workplace_Name,Workplace_Lookup!B89)),0,1)","v":1},{"$f":"IF(C89=0,\"\",COUNTIF($B$2:C89,1))","v":88},"Belgian Gardens State School"]
[781,"Bell State School",{"$f":"IF(ISERROR(SEARCH(Workplace_Name,Workplace_Lookup!B90)),0,1)","v":1},{"$f":"IF(C90=0,\"\",COUNTIF($B$2:C90,1))","v":89},"Bell State School"]
["B260","Bellbird Park State School",{"$f":"IF(ISERROR(SEARCH(Workplace_Name,Workplace_Lookup!B91)),0,1)","v":1},{"$f":"IF(C91=0,\"\",COUNTIF($B$2:C91,1))","v":90},"Bellbird Park State School"]
[9322,"Bellbird Park State Secondary College",{"$f":"IF(ISERROR(SEARCH(Workplace_Name,Workplace_Lookup!B92)),0,1)","v":1},{"$f":"IF(C92=0,\"\",COUNTIF($B$2:C92,1))","v":91},"Bellbird Park State Secondary College"]
[1768,"Bellenden Ker State School",{"$f":"IF(ISERROR(SEARCH(Workplace_Name,Workplace_Lookup!B93)),0,1)","v":1},{"$f":"IF(C93=0,\"\",COUNTIF($B$2:C93,1))","v":92},"Bellenden Ker State School"]
[1925,"Bellevue Park State School",{"$f":"IF(ISERROR(SEARCH(Workplace_Name,Workplace_Lookup!B94)),0,1)","v":1},{"$f":"IF(C94=0,\"\",COUNTIF($B$2:C94,1))","v":93},"Bellevue Park State School"]
[9319,"Bellmere State School",{"$f":"IF(ISERROR(SEARCH(Workplace_Name,Workplace_Lookup!B95)),0,1)","v":1},{"$f":"IF(C95=0,\"\",COUNTIF($B$2:C95,1))","v":94},"Bellmere State School"]
[226,"Belmont State School",{"$f":"IF(ISERROR(SEARCH(Workplace_Name,Workplace_Lookup!B96)),0,1)","v":1},{"$f":"IF(C96=0,\"\",COUNTIF($B$2:C96,1))","v":95},"Belmont State School"]
[393,"Benaraby State School",{"$f":"IF(ISERROR(SEARCH(Workplace_Name,Workplace_Lookup!B97)),0,1)","v":1},{"$f":"IF(C97=0,\"\",COUNTIF($B$2:C97,1))","v":96},"Benaraby State School"]
[1631,"Benarkin State School",{"$f":"IF(ISERROR(SEARCH(Workplace_Name,Workplace_Lookup!B98)),0,1)","v":1},{"$f":"IF(C98=0,\"\",COUNTIF($B$2:C98,1))","v":97},"Benarkin State School"]
[2150,"Benowa State High School",{"$f":"IF(ISERROR(SEARCH(Workplace_Name,Workplace_Lookup!B99)),0,1)","v":1},{"$f":"IF(C99=0,\"\",COUNTIF($B$2:C99,1))","v":98},"Benowa State High School"]
[481,"Benowa State School",{"$f":"IF(ISERROR(SEARCH(Workplace_Name,Workplace_Lookup!B100)),0,1)","v":1},{"$f":"IF(C100=0,\"\",COUNTIF($B$2:C100,1))","v":99},"Benowa State School"]
[452,"Bentley Park College",{"$f":"IF(ISERROR(SEARCH(Workplace_Name,Workplace_Lookup!B101)),0,1)","v":1},{"$f":"IF(C101=0,\"\",COUNTIF($B$2:C101,1))","v":100},"Bentley Park College"]
[1867,"Berrinba East State School",{"$f":"IF(ISERROR(SEARCH(Workplace_Name,Workplace_Lookup!B102)),0,1)","v":1},{"$f":"IF(C102=0,\"\",COUNTIF($B$2:C102,1))","v":101},"Berrinba East State School"]
[1546,"Berserker Street State School",{"$f":"IF(ISERROR(SEARCH(Workplace_Name,Workplace_Lookup!B103)),0,1)","v":1},{"$f":"IF(C103=0,\"\",COUNTIF($B$2:C103,1))","v":102},"Berserker Street State School"]
[996,"Biboohra State School",{"$f":"IF(ISERROR(SEARCH(Workplace_Name,Workplace_Lookup!B104)),0,1)","v":1},{"$f":"IF(C104=0,\"\",COUNTIF($B$2:C104,1))","v":103},"Biboohra State School"]
[1663,"Biddeston State School",{"$f":"IF(ISERROR(SEARCH(Workplace_Name,Workplace_Lookup!B105)),0,1)","v":1},{"$f":"IF(C105=0,\"\",COUNTIF($B$2:C105,1))","v":104},"Biddeston State School"]
[666,"Biggenden State School",{"$f":"IF(ISERROR(SEARCH(Workplace_Name,Workplace_Lookup!B106)),0,1)","v":1},{"$f":"IF(C106=0,\"\",COUNTIF($B$2:C106,1))","v":105},"Biggenden State School"]
[65,"Biggera Waters State School",{"$f":"IF(ISERROR(SEARCH(Workplace_Name,Workplace_Lookup!B107)),0,1)","v":1},{"$f":"IF(C107=0,\"\",COUNTIF($B$2:C107,1))","v":106},"Biggera Waters State School"]
[2085,"Biloela State High School",{"$f":"IF(ISERROR(SEARCH(Workplace_Name,Workplace_Lookup!B108)),0,1)","v":1},{"$f":"IF(C108=0,\"\",COUNTIF($B$2:C108,1))","v":107},"Biloela State High School"]
[1822,"Biloela State School",{"$f":"IF(ISERROR(SEARCH(Workplace_Name,Workplace_Lookup!B109)),0,1)","v":1},{"$f":"IF(C109=0,\"\",COUNTIF($B$2:C109,1))","v":108},"Biloela State School"]
[1397,"Binjour Plateau State School",{"$f":"IF(ISERROR(SEARCH(Workplace_Name,Workplace_Lookup!B110)),0,1)","v":1},{"$f":"IF(C110=0,\"\",COUNTIF($B$2:C110,1))","v":109},"Binjour Plateau State School"]
[1679,"Birdsville State School",{"$f":"IF(ISERROR(SEARCH(Workplace_Name,Workplace_Lookup!B111)),0,1)","v":1},{"$f":"IF(C111=0,\"\",COUNTIF($B$2:C111,1))","v":110},"Birdsville State School"]
[1915,"Birkdale South State School",{"$f":"IF(ISERROR(SEARCH(Workplace_Name,Workplace_Lookup!B112)),0,1)","v":1},{"$f":"IF(C112=0,\"\",COUNTIF($B$2:C112,1))","v":111},"Birkdale South State School"]
[1545,"Birkdale State School",{"$f":"IF(ISERROR(SEARCH(Workplace_Name,Workplace_Lookup!B113)),0,1)","v":1},{"$f":"IF(C113=0,\"\",COUNTIF($B$2:C113,1))","v":112},"Birkdale State School"]
[299,"Blackall State School",{"$f":"IF(ISERROR(SEARCH(Workplace_Name,Workplace_Lookup!B114)),0,1)","v":1},{"$f":"IF(C114=0,\"\",COUNTIF($B$2:C114,1))","v":113},"Blackall State School"]
[739,"Blackbutt State School",{"$f":"IF(ISERROR(SEARCH(Workplace_Name,Workplace_Lookup!B115)),0,1)","v":1},{"$f":"IF(C115=0,\"\",COUNTIF($B$2:C115,1))","v":114},"Blackbutt State School"]
[1891,"Blackwater North State School",{"$f":"IF(ISERROR(SEARCH(Workplace_Name,Workplace_Lookup!B116)),0,1)","v":1},{"$f":"IF(C116=0,\"\",COUNTIF($B$2:C116,1))","v":115},"Blackwater North State School"]
[2134,"Blackwater State High School",{"$f":"IF(ISERROR(SEARCH(Workplace_Name,Workplace_Lookup!B117)),0,1)","v":1},{"$f":"IF(C117=0,\"\",COUNTIF($B$2:C117,1))","v":116},"Blackwater State High School"]
[396,"Blackwater State School",{"$f":"IF(ISERROR(SEARCH(Workplace_Name,Workplace_Lookup!B118)),0,1)","v":1},{"$f":"IF(C118=0,\"\",COUNTIF($B$2:C118,1))","v":117},"Blackwater State School"]
[1565,"Blair State School",{"$f":"IF(ISERROR(SEARCH(Workplace_Name,Workplace_Lookup!B119)),0,1)","v":1},{"$f":"IF(C119=0,\"\",COUNTIF($B$2:C119,1))","v":118},"Blair State School"]
[316,"Blenheim State School",{"$f":"IF(ISERROR(SEARCH(Workplace_Name,Workplace_Lookup!B120)),0,1)","v":1},{"$f":"IF(C120=0,\"\",COUNTIF($B$2:C120,1))","v":119},"Blenheim State School"]
[952,"Bli Bli State School",{"$f":"IF(ISERROR(SEARCH(Workplace_Name,Workplace_Lookup!B121)),0,1)","v":1},{"$f":"IF(C121=0,\"\",COUNTIF($B$2:C121,1))","v":120},"Bli Bli State School"]
[1173,"Bloomfield River State School",{"$f":"IF(ISERROR(SEARCH(Workplace_Name,Workplace_Lookup!B122)),0,1)","v":1},{"$f":"IF(C122=0,\"\",COUNTIF($B$2:C122,1))","v":121},"Bloomfield River State School"]
[981,"Bloomsbury State School",{"$f":"IF(ISERROR(SEARCH(Workplace_Name,Workplace_Lookup!B123)),0,1)","v":1},{"$f":"IF(C123=0,\"\",COUNTIF($B$2:C123,1))","v":122},"Bloomsbury State School"]
[612,"Bluewater State School",{"$f":"IF(ISERROR(SEARCH(Workplace_Name,Workplace_Lookup!B124)),0,1)","v":1},{"$f":"IF(C124=0,\"\",COUNTIF($B$2:C124,1))","v":123},"Bluewater State School"]
[344,"Bluff State School",{"$f":"IF(ISERROR(SEARCH(Workplace_Name,Workplace_Lookup!B125)),0,1)","v":1},{"$f":"IF(C125=0,\"\",COUNTIF($B$2:C125,1))","v":124},"Bluff State School"]
[1299,"Bohlevale State School",{"$f":"IF(ISERROR(SEARCH(Workplace_Name,Workplace_Lookup!B126)),0,1)","v":1},{"$f":"IF(C126=0,\"\",COUNTIF($B$2:C126,1))","v":125},"Bohlevale State School"]
[425,"Bollon State School",{"$f":"IF(ISERROR(SEARCH(Workplace_Name,Workplace_Lookup!B127)),0,1)","v":1},{"$f":"IF(C127=0,\"\",COUNTIF($B$2:C127,1))","v":126},"Bollon State School"]
[2105,"Boonah State High School",{"$f":"IF(ISERROR(SEARCH(Workplace_Name,Workplace_Lookup!B128)),0,1)","v":1},{"$f":"IF(C128=0,\"\",COUNTIF($B$2:C128,1))","v":127},"Boonah State High School"]
[333,"Boonah State School",{"$f":"IF(ISERROR(SEARCH(Workplace_Name,Workplace_Lookup!B129)),0,1)","v":1},{"$f":"IF(C129=0,\"\",COUNTIF($B$2:C129,1))","v":128},"Boonah State School"]
[1603,"Boondall State School",{"$f":"IF(ISERROR(SEARCH(Workplace_Name,Workplace_Lookup!B130)),0,1)","v":1},{"$f":"IF(C130=0,\"\",COUNTIF($B$2:C130,1))","v":129},"Boondall State School"]
[1542,"Booyal Central State School",{"$f":"IF(ISERROR(SEARCH(Workplace_Name,Workplace_Lookup!B131)),0,1)","v":1},{"$f":"IF(C131=0,\"\",COUNTIF($B$2:C131,1))","v":130},"Booyal Central State School"]
[1981,"Boronia Heights State School",{"$f":"IF(ISERROR(SEARCH(Workplace_Name,Workplace_Lookup!B132)),0,1)","v":1},{"$f":"IF(C132=0,\"\",COUNTIF($B$2:C132,1))","v":131},{"$f":"IFERROR(INDEX(B:B,MATCH(ROW(B131),D:D,0)),\"\")","v":"Boronia Heights State School"}]
[899,"Bororen State School",{"$f":"IF(ISERROR(SEARCH(Workplace_Name,Workplace_Lookup!B133)),0,1)","v":1},{"$f":"IF(C133=0,\"\",COUNTIF($B$2:C133,1))","v":132},"Bororen State School"]
[57,"Bouldercombe State School",{"$f":"IF(ISERROR(SEARCH(Workplace_Name,Workplace_Lookup!B134)),0,1)","v":1},{"$f":"IF(C134=0,\"\",COUNTIF($B$2:C134,1))","v":133},"Bouldercombe State School"]
[595,"Boulia State School",{"$f":"IF(ISERROR(SEARCH(Workplace_Name,Workplace_Lookup!B135)),0,1)","v":1},{"$f":"IF(C135=0,\"\",COUNTIF($B$2:C135,1))","v":134},"Boulia State School"]
[6134,"Bounty Boulevard State School",{"$f":"IF(ISERROR(SEARCH(Workplace_Name,Workplace_Lookup!B136)),0,1)","v":1},{"$f":"IF(C136=0,\"\",COUNTIF($B$2:C136,1))","v":135},"Bounty Boulevard State School"]
[2065,"Bowen State High School",{"$f":"IF(ISERROR(SEARCH(Workplace_Name,Workplace_Lookup!B137)),0,1)","v":1},{"$f":"IF(C137=0,\"\",COUNTIF($B$2:C137,1))","v":136},"Bowen State High School"]
[10,"Bowen State School",{"$f":"IF(ISERROR(SEARCH(Workplace_Name,Workplace_Lookup!B138)),0,1)","v":1},{"$f":"IF(C138=0,\"\",COUNTIF($B$2:C138,1))","v":137},"Bowen State School"]
[815,"Bowenville State School",{"$f":"IF(ISERROR(SEARCH(Workplace_Name,Workplace_Lookup!B139)),0,1)","v":1},{"$f":"IF(C139=0,\"\",COUNTIF($B$2:C139,1))","v":138},"Bowenville State School"]
[3561,"Boyne Island Environmental Education Centre",{"$f":"IF(ISERROR(SEARCH(Workplace_Name,Workplace_Lookup!B140)),0,1)","v":1},{"$f":"IF(C140=0,\"\",COUNTIF($B$2:C140,1))","v":139},"Boyne Island Environmental Education Centre"]
[1191,"Boyne Island State School",{"$f":"IF(ISERROR(SEARCH(Workplace_Name,Workplace_Lookup!B141)),0,1)","v":1},{"$f":"IF(C141=0,\"\",COUNTIF($B$2:C141,1))","v":140},"Boyne Island State School"]
[1465,"Boynewood State School",{"$f":"IF(ISERROR(SEARCH(Workplace_Name,Workplace_Lookup!B142)),0,1)","v":1},{"$f":"IF(C142=0,\"\",COUNTIF($B$2:C142,1))","v":141},"Boynewood State School"]
[2118,"Bracken Ridge State High School",{"$f":"IF(ISERROR(SEARCH(Workplace_Name,Workplace_Lookup!B143)),0,1)","v":1},{"$f":"IF(C143=0,\"\",COUNTIF($B$2:C143,1))","v":142},"Bracken Ridge State High School"]
[772,"Bracken Ridge State School",{"$f":"IF(ISERROR(SEARCH(Workplace_Name,Workplace_Lookup!B144)),0,1)","v":1},{"$f":"IF(C144=0,\"\",COUNTIF($B$2:C144,1))","v":143},"Bracken Ridge State School"]
[466,"Brandon State School",{"$f":"IF(ISERROR(SEARCH(Workplace_Name,Workplace_Lookup!B145)),0,1)","v":1},{"$f":"IF(C145=0,\"\",COUNTIF($B$2:C145,1))","v":144},"Brandon State School"]
[1066,"Branyan Road State School",{"$f":"IF(ISERROR(SEARCH(Workplace_Name,Workplace_Lookup!B146)),0,1)","v":1},{"$f":"IF(C146=0,\"\",COUNTIF($B$2:C146,1))","v":145},"Branyan Road State School"]
[571,"Brassall State School",{"$f":"IF(ISERROR(SEARCH(Workplace_Name,Workplace_Lookup!B147)),0,1)","v":1},{"$f":"IF(C147=0,\"\",COUNTIF($B$2:C147,1))","v":146},"Brassall State School"]
[2173,"Bray Park State High School",{"$f":"IF(ISERROR(SEARCH(Workplace_Name,Workplace_Lookup!B148)),0,1)","v":1},{"$f":"IF(C148=0,\"\",COUNTIF($B$2:C148,1))","v":147},"Bray Park State High School"]
[339,"Bray Park State School",{"$f":"IF(ISERROR(SEARCH(Workplace_Name,Workplace_Lookup!B149)),0,1)","v":1},{"$f":"IF(C149=0,\"\",COUNTIF($B$2:C149,1))","v":148},"Bray Park State School"]
[2050,"Bremer State High School",{"$f":"IF(ISERROR(SEARCH(Workplace_Name,Workplace_Lookup!B150)),0,1)","v":1},{"$f":"IF(C150=0,\"\",COUNTIF($B$2:C150,1))","v":149},"Bremer State High School"]
[2181,"Bribie Island State High School",{"$f":"IF(ISERROR(SEARCH(Workplace_Name,Workplace_Lookup!B151)),0,1)","v":1},{"$f":"IF(C151=0,\"\",COUNTIF($B$2:C151,1))","v":150},"Bribie Island State High School"]
[540,"Bribie Island State School",{"$f":"IF(ISERROR(SEARCH(Workplace_Name,Workplace_Lookup!B152)),0,1)","v":1},{"$f":"IF(C152=0,\"\",COUNTIF($B$2:C152,1))","v":151},"Bribie Island State School"]
[1133,"Brigalow State School",{"$f":"IF(ISERROR(SEARCH(Workplace_Name,Workplace_Lookup!B153)),0,1)","v":1},{"$f":"IF(C153=0,\"\",COUNTIF($B$2:C153,1))","v":152},"Brigalow State School"]
[1669,"Brighton State School",{"$f":"IF(ISERROR(SEARCH(Workplace_Name,Workplace_Lookup!B154)),0,1)","v":1},{"$f":"IF(C154=0,\"\",COUNTIF($B$2:C154,1))","v":153},"Brighton State School"]
[7573,"Brightwater State School",{"$f":"IF(ISERROR(SEARCH(Workplace_Name,Workplace_Lookup!B155)),0,1)","v":1},{"$f":"IF(C155=0,\"\",COUNTIF($B$2:C155,1))","v":154},"Brightwater State School"]
[2104,"Brisbane Bayside State College",{"$f":"IF(ISERROR(SEARCH(Workplace_Name,Workplace_Lookup!B156)),0,1)","v":1},{"$f":"IF(C156=0,\"\",COUNTIF($B$2:C156,1))","v":155},"Brisbane Bayside State College"]
[207,"Brisbane Central State School",{"$f":"IF(ISERROR(SEARCH(Workplace_Name,Workplace_Lookup!B157)),0,1)","v":1},{"$f":"IF(C157=0,\"\",COUNTIF($B$2:C157,1))","v":156},"Brisbane Central State School"]
[5512,"Brisbane International Student Centre",{"$f":"IF(ISERROR(SEARCH(Workplace_Name,Workplace_Lookup!B158)),0,1)","v":1},{"$f":"IF(C158=0,\"\",COUNTIF($B$2:C158,1))","v":157},"Brisbane International Student Centre"]
[3605,"Brisbane School of Distance Education",{"$f":"IF(ISERROR(SEARCH(Workplace_Name,Workplace_Lookup!B159)),0,1)","v":1},{"$f":"IF(C159=0,\"\",COUNTIF($B$2:C159,1))","v":158},"Brisbane School of Distance Education"]
["A792","Brisbane South State Secondary College",{"$f":"IF(ISERROR(SEARCH(Workplace_Name,Workplace_Lookup!B160)),0,1)","v":1},{"$f":"IF(C160=0,\"\",COUNTIF($B$2:C160,1))","v":159},"Brisbane South State Secondary College"]
[2003,"Brisbane State High School",{"$f":"IF(ISERROR(SEARCH(Workplace_Name,Workplace_Lookup!B161)),0,1)","v":1},{"$f":"IF(C161=0,\"\",COUNTIF($B$2:C161,1))","v":160},"Brisbane State High School"]
[3554,"Brisbane Urban Environmental Education Centre",{"$f":"IF(ISERROR(SEARCH(Workplace_Name,Workplace_Lookup!B162)),0,1)","v":1},{"$f":"IF(C162=0,\"\",COUNTIF($B$2:C162,1))","v":161},"Brisbane Urban Environmental Education Centre"]
[2294,"Brisbane Youth Education and Training Centre",{"$f":"IF(ISERROR(SEARCH(Workplace_Name,Workplace_Lookup!B163)),0,1)","v":1},{"$f":"IF(C163=0,\"\",COUNTIF($B$2:C163,1))","v":162},"Brisbane Youth Education and Training Centre"]
[1381,"Broadbeach State School",{"$f":"IF(ISERROR(SEARCH(Workplace_Name,Workplace_Lookup!B164)),0,1)","v":1},{"$f":"IF(C164=0,\"\",COUNTIF($B$2:C164,1))","v":163},"Broadbeach State School"]
[1071,"Broadwater State School",{"$f":"IF(ISERROR(SEARCH(Workplace_Name,Workplace_Lookup!B165)),0,1)","v":1},{"$f":"IF(C165=0,\"\",COUNTIF($B$2:C165,1))","v":164},"Broadwater State School"]
[16,"Brookfield State School",{"$f":"IF(ISERROR(SEARCH(Workplace_Name,Workplace_Lookup!B166)),0,1)","v":1},{"$f":"IF(C166=0,\"\",COUNTIF($B$2:C166,1))","v":165},"Brookfield State School"]
[311,"Brookstead State School",{"$f":"IF(ISERROR(SEARCH(Workplace_Name,Workplace_Lookup!B167)),0,1)","v":1},{"$f":"IF(C167=0,\"\",COUNTIF($B$2:C167,1))","v":166},"Brookstead State School"]
[1035,"Brooweena State School",{"$f":"IF(ISERROR(SEARCH(Workplace_Name,Workplace_Lookup!B168)),0,1)","v":1},{"$f":"IF(C168=0,\"\",COUNTIF($B$2:C168,1))","v":167},"Brooweena State School"]
[2164,"Browns Plains State High School",{"$f":"IF(ISERROR(SEARCH(Workplace_Name,Workplace_Lookup!B169)),0,1)","v":1},{"$f":"IF(C169=0,\"\",COUNTIF($B$2:C169,1))","v":168},"Browns Plains State High School"]
[1922,"Browns Plains State School",{"$f":"IF(ISERROR(SEARCH(Workplace_Name,Workplace_Lookup!B170)),0,1)","v":1},{"$f":"IF(C170=0,\"\",COUNTIF($B$2:C170,1))","v":169},"Browns Plains State School"]
[1939,"Bucasia State School",{"$f":"IF(ISERROR(SEARCH(Workplace_Name,Workplace_Lookup!B171)),0,1)","v":1},{"$f":"IF(C171=0,\"\",COUNTIF($B$2:C171,1))","v":170},"Bucasia State School"]
[1888,"Buddina State School",{"$f":"IF(ISERROR(SEARCH(Workplace_Name,Workplace_Lookup!B172)),0,1)","v":1},{"$f":"IF(C172=0,\"\",COUNTIF($B$2:C172,1))","v":171},"Buddina State School"]
[223,"Buderim Mountain State School",{"$f":"IF(ISERROR(SEARCH(Workplace_Name,Workplace_Lookup!B173)),0,1)","v":1},{"$f":"IF(C173=0,\"\",COUNTIF($B$2:C173,1))","v":172},"Buderim Mountain State School"]
[1124,"Builyan State School",{"$f":"IF(ISERROR(SEARCH(Workplace_Name,Workplace_Lookup!B174)),0,1)","v":1},{"$f":"IF(C174=0,\"\",COUNTIF($B$2:C174,1))","v":173},"Builyan State School"]
[17,"Bulimba State School",{"$f":"IF(ISERROR(SEARCH(Workplace_Name,Workplace_Lookup!B175)),0,1)","v":1},{"$f":"IF(C175=0,\"\",COUNTIF($B$2:C175,1))","v":174},"Bulimba State School"]
[962,"Bullyard State School",{"$f":"IF(ISERROR(SEARCH(Workplace_Name,Workplace_Lookup!B176)),0,1)","v":1},{"$f":"IF(C176=0,\"\",COUNTIF($B$2:C176,1))","v":175},"Bullyard State School"]
[18,"Bundaberg Central State School",{"$f":"IF(ISERROR(SEARCH(Workplace_Name,Workplace_Lookup!B177)),0,1)","v":1},{"$f":"IF(C177=0,\"\",COUNTIF($B$2:C177,1))","v":176},"Bundaberg Central State School"]
[497,"Bundaberg East State School",{"$f":"IF(ISERROR(SEARCH(Workplace_Name,Workplace_Lookup!B178)),0,1)","v":1},{"$f":"IF(C178=0,\"\",COUNTIF($B$2:C178,1))","v":177},"Bundaberg East State School"]
[2019,"Bundaberg North State High School",{"$f":"IF(ISERROR(SEARCH(Workplace_Name,Workplace_Lookup!B179)),0,1)","v":1},{"$f":"IF(C179=0,\"\",COUNTIF($B$2:C179,1))","v":178},"Bundaberg North State High School"]
[161,"Bundaberg North State School",{"$f":"IF(ISERROR(SEARCH(Workplace_Name,Workplace_Lookup!B180)),0,1)","v":1},{"$f":"IF(C180=0,\"\",COUNTIF($B$2:C180,1))","v":179},"Bundaberg North State School"]
[8388,"Bundaberg Regional Trade Training Centre",{"$f":"IF(ISERROR(SEARCH(Workplace_Name,Workplace_Lookup!B181)),0,1)","v":1},{"$f":"IF(C181=0,\"\",COUNTIF($B$2:C181,1))","v":180},"Bundaberg Regional Trade Training Centre"]
[637,"Bundaberg South State School",{"$f":"IF(ISERROR(SEARCH(Workplace_Name,Workplace_Lookup!B182)),0,1)","v":1},{"$f":"IF(C182=0,\"\",COUNTIF($B$2:C182,1))","v":181},"Bundaberg South State School"]
[3029,"Bundaberg Special School",{"$f":"IF(ISERROR(SEARCH(Workplace_Name,Workplace_Lookup!B183)),0,1)","v":1},{"$f":"IF(C183=0,\"\",COUNTIF($B$2:C183,1))","v":182},"Bundaberg Special School"]
[2004,"Bundaberg State High School",{"$f":"IF(ISERROR(SEARCH(Workplace_Name,Workplace_Lookup!B184)),0,1)","v":1},{"$f":"IF(C184=0,\"\",COUNTIF($B$2:C184,1))","v":183},"Bundaberg State High School"]
[1836,"Bundaberg West State School",{"$f":"IF(ISERROR(SEARCH(Workplace_Name,Workplace_Lookup!B185)),0,1)","v":1},{"$f":"IF(C185=0,\"\",COUNTIF($B$2:C185,1))","v":184},"Bundaberg West State School"]
[19,"Bundamba State School",{"$f":"IF(ISERROR(SEARCH(Workplace_Name,Workplace_Lookup!B186)),0,1)","v":1},{"$f":"IF(C186=0,\"\",COUNTIF($B$2:C186,1))","v":185},"Bundamba State School"]
[2130,"Bundamba State Secondary College",{"$f":"IF(ISERROR(SEARCH(Workplace_Name,Workplace_Lookup!B187)),0,1)","v":1},{"$f":"IF(C187=0,\"\",COUNTIF($B$2:C187,1))","v":186},"Bundamba State Secondary College"]
[1508,"Bungunya State School",{"$f":"IF(ISERROR(SEARCH(Workplace_Name,Workplace_Lookup!B188)),0,1)","v":1},{"$f":"IF(C188=0,\"\",COUNTIF($B$2:C188,1))","v":187},"Bungunya State School"]
[853,"Bunker's Hill State School",{"$f":"IF(ISERROR(SEARCH(Workplace_Name,Workplace_Lookup!B189)),0,1)","v":1},{"$f":"IF(C189=0,\"\",COUNTIF($B$2:C189,1))","v":188},"Bunker's Hill State School"]
[3556,"Bunyaville Environmental Education Centre",{"$f":"IF(ISERROR(SEARCH(Workplace_Name,Workplace_Lookup!B190)),0,1)","v":1},{"$f":"IF(C190=0,\"\",COUNTIF($B$2:C190,1))","v":189},"Bunyaville Environmental Education Centre"]
[894,"Buranda State School",{"$f":"IF(ISERROR(SEARCH(Workplace_Name,Workplace_Lookup!B191)),0,1)","v":1},{"$f":"IF(C191=0,\"\",COUNTIF($B$2:C191,1))","v":190},"Buranda State School"]
[3003,"Burdekin School",{"$f":"IF(ISERROR(SEARCH(Workplace_Name,Workplace_Lookup!B192)),0,1)","v":1},{"$f":"IF(C192=0,\"\",COUNTIF($B$2:C192,1))","v":191},"Burdekin School"]
[530,"Burketown State School",{"$f":"IF(ISERROR(SEARCH(Workplace_Name,Workplace_Lookup!B193)),0,1)","v":1},{"$f":"IF(C193=0,\"\",COUNTIF($B$2:C193,1))","v":192},"Burketown State School"]
[1568,"Burleigh Heads State School",{"$f":"IF(ISERROR(SEARCH(Workplace_Name,Workplace_Lookup!B194)),0,1)","v":1},{"$f":"IF(C194=0,\"\",COUNTIF($B$2:C194,1))","v":193},"Burleigh Heads State School"]
[319,"Burnett Heads State School",{"$f":"IF(ISERROR(SEARCH(Workplace_Name,Workplace_Lookup!B195)),0,1)","v":1},{"$f":"IF(C195=0,\"\",COUNTIF($B$2:C195,1))","v":194},"Burnett Heads State School"]
[2089,"Burnett State College",{"$f":"IF(ISERROR(SEARCH(Workplace_Name,Workplace_Lookup!B196)),0,1)","v":1},{"$f":"IF(C196=0,\"\",COUNTIF($B$2:C196,1))","v":195},{"$f":"IFERROR(INDEX(B:B,MATCH(ROW(B195),D:D,0)),\"\")","v":"Burnett State College"}]
[2145,"Burnside State High School",{"$f":"IF(ISERROR(SEARCH(Workplace_Name,Workplace_Lookup!B197)),0,1)","v":1},{"$f":"IF(C197=0,\"\",COUNTIF($B$2:C197,1))","v":196},"Burnside State High School"]
[1873,"Burnside State School",{"$f":"IF(ISERROR(SEARCH(Workplace_Name,Workplace_Lookup!B198)),0,1)","v":1},{"$f":"IF(C198=0,\"\",COUNTIF($B$2:C198,1))","v":197},"Burnside State School"]
[5553,"Burpengary Meadows State School",{"$f":"IF(ISERROR(SEARCH(Workplace_Name,Workplace_Lookup!B199)),0,1)","v":1},{"$f":"IF(C199=0,\"\",COUNTIF($B$2:C199,1))","v":198},"Burpengary Meadows State School"]
[601,"Burpengary State School",{"$f":"IF(ISERROR(SEARCH(Workplace_Name,Workplace_Lookup!B200)),0,1)","v":1},{"$f":"IF(C200=0,\"\",COUNTIF($B$2:C200,1))","v":199},"Burpengary State School"]
[9676,"Burpengary State Secondary College",{"$f":"IF(ISERROR(SEARCH(Workplace_Name,Workplace_Lookup!B201)),0,1)","v":1},{"$f":"IF(C201=0,\"\",COUNTIF($B$2:C201,1))","v":200},"Burpengary State Secondary College"]
[1129,"Burra Burri State School",{"$f":"IF(ISERROR(SEARCH(Workplace_Name,Workplace_Lookup!B202)),0,1)","v":1},{"$f":"IF(C202=0,\"\",COUNTIF($B$2:C202,1))","v":201},"Burra Burri State School"]
[1966,"Burrowes State School",{"$f":"IF(ISERROR(SEARCH(Workplace_Name,Workplace_Lookup!B203)),0,1)","v":1},{"$f":"IF(C203=0,\"\",COUNTIF($B$2:C203,1))","v":202},"Burrowes State School"]
[1427,"Butchers Creek State School",{"$f":"IF(ISERROR(SEARCH(Workplace_Name,Workplace_Lookup!B204)),0,1)","v":1},{"$f":"IF(C204=0,\"\",COUNTIF($B$2:C204,1))","v":203},"Butchers Creek State School"]
[379,"Bwgcolman Community School",{"$f":"IF(ISERROR(SEARCH(Workplace_Name,Workplace_Lookup!B205)),0,1)","v":1},{"$f":"IF(C205=0,\"\",COUNTIF($B$2:C205,1))","v":204},"Bwgcolman Community School"]
[1318,"Byfield State School",{"$f":"IF(ISERROR(SEARCH(Workplace_Name,Workplace_Lookup!B206)),0,1)","v":1},{"$f":"IF(C206=0,\"\",COUNTIF($B$2:C206,1))","v":205},"Byfield State School"]
[1047,"Bymount East State School",{"$f":"IF(ISERROR(SEARCH(Workplace_Name,Workplace_Lookup!B207)),0,1)","v":1},{"$f":"IF(C207=0,\"\",COUNTIF($B$2:C207,1))","v":206},"Bymount East State School"]
[1903,"Caboolture East State School",{"$f":"IF(ISERROR(SEARCH(Workplace_Name,Workplace_Lookup!B208)),0,1)","v":1},{"$f":"IF(C208=0,\"\",COUNTIF($B$2:C208,1))","v":207},"Caboolture East State School"]
[3045,"Caboolture Special School",{"$f":"IF(ISERROR(SEARCH(Workplace_Name,Workplace_Lookup!B209)),0,1)","v":1},{"$f":"IF(C209=0,\"\",COUNTIF($B$2:C209,1))","v":208},"Caboolture Special School"]
[2066,"Caboolture State High School",{"$f":"IF(ISERROR(SEARCH(Workplace_Name,Workplace_Lookup!B210)),0,1)","v":1},{"$f":"IF(C210=0,\"\",COUNTIF($B$2:C210,1))","v":209},"Caboolture State High School"]
[369,"Caboolture State School",{"$f":"IF(ISERROR(SEARCH(Workplace_Name,Workplace_Lookup!B211)),0,1)","v":1},{"$f":"IF(C211=0,\"\",COUNTIF($B$2:C211,1))","v":210},"Caboolture State School"]
["B298","Caboolture Watchhouse Education Support Hub",{"$f":"IF(ISERROR(SEARCH(Workplace_Name,Workplace_Lookup!B212)),0,1)","v":1},{"$f":"IF(C212=0,\"\",COUNTIF($B$2:C212,1))","v":211},"Caboolture Watchhouse Education Support Hub"]
[3601,"Cairns School of Distance Education",{"$f":"IF(ISERROR(SEARCH(Workplace_Name,Workplace_Lookup!B213)),0,1)","v":1},{"$f":"IF(C213=0,\"\",COUNTIF($B$2:C213,1))","v":212},"Cairns School of Distance Education"]
[2005,"Cairns State High School",{"$f":"IF(ISERROR(SEARCH(Workplace_Name,Workplace_Lookup!B214)),0,1)","v":1},{"$f":"IF(C214=0,\"\",COUNTIF($B$2:C214,1))","v":213},"Cairns State High School"]
["A029","Cairns State Special School",{"$f":"IF(ISERROR(SEARCH(Workplace_Name,Workplace_Lookup!B215)),0,1)","v":1},{"$f":"IF(C215=0,\"\",COUNTIF($B$2:C215,1))","v":214},"Cairns State Special School"]
[1522,"Cairns West State School",{"$f":"IF(ISERROR(SEARCH(Workplace_Name,Workplace_Lookup!B216)),0,1)","v":1},{"$f":"IF(C216=0,\"\",COUNTIF($B$2:C216,1))","v":215},"Cairns West State School"]
[1699,"Calamvale Community College",{"$f":"IF(ISERROR(SEARCH(Workplace_Name,Workplace_Lookup!B217)),0,1)","v":1},{"$f":"IF(C217=0,\"\",COUNTIF($B$2:C217,1))","v":216},"Calamvale Community College"]
[3055,"Calamvale Special School",{"$f":"IF(ISERROR(SEARCH(Workplace_Name,Workplace_Lookup!B218)),0,1)","v":1},{"$f":"IF(C218=0,\"\",COUNTIF($B$2:C218,1))","v":217},"Calamvale Special School"]
[1550,"Calen District State College",{"$f":"IF(ISERROR(SEARCH(Workplace_Name,Workplace_Lookup!B219)),0,1)","v":1},{"$f":"IF(C219=0,\"\",COUNTIF($B$2:C219,1))","v":218},"Calen District State College"]
[9790,"Calliope State High School",{"$f":"IF(ISERROR(SEARCH(Workplace_Name,Workplace_Lookup!B220)),0,1)","v":1},{"$f":"IF(C220=0,\"\",COUNTIF($B$2:C220,1))","v":219},"Calliope State High School"]
[20,"Calliope State School",{"$f":"IF(ISERROR(SEARCH(Workplace_Name,Workplace_Lookup!B221)),0,1)","v":1},{"$f":"IF(C221=0,\"\",COUNTIF($B$2:C221,1))","v":220},"Calliope State School"]
[2116,"Caloundra State High School",{"$f":"IF(ISERROR(SEARCH(Workplace_Name,Workplace_Lookup!B222)),0,1)","v":1},{"$f":"IF(C222=0,\"\",COUNTIF($B$2:C222,1))","v":221},"Caloundra State High School"]
[859,"Caloundra State School",{"$f":"IF(ISERROR(SEARCH(Workplace_Name,Workplace_Lookup!B223)),0,1)","v":1},{"$f":"IF(C223=0,\"\",COUNTIF($B$2:C223,1))","v":222},"Caloundra State School"]
[196,"Cambooya State School",{"$f":"IF(ISERROR(SEARCH(Workplace_Name,Workplace_Lookup!B224)),0,1)","v":1},{"$f":"IF(C224=0,\"\",COUNTIF($B$2:C224,1))","v":223},"Cambooya State School"]
[483,"Cameron Downs State School",{"$f":"IF(ISERROR(SEARCH(Workplace_Name,Workplace_Lookup!B225)),0,1)","v":1},{"$f":"IF(C225=0,\"\",COUNTIF($B$2:C225,1))","v":224},"Cameron Downs State School"]
[352,"Camira State School",{"$f":"IF(ISERROR(SEARCH(Workplace_Name,Workplace_Lookup!B226)),0,1)","v":1},{"$f":"IF(C226=0,\"\",COUNTIF($B$2:C226,1))","v":225},"Camira State School"]
[714,"Camooweal State School",{"$f":"IF(ISERROR(SEARCH(Workplace_Name,Workplace_Lookup!B227)),0,1)","v":1},{"$f":"IF(C227=0,\"\",COUNTIF($B$2:C227,1))","v":226},"Camooweal State School"]
[3572,"Camp Fairbairn Outdoor Education Centre",{"$f":"IF(ISERROR(SEARCH(Workplace_Name,Workplace_Lookup!B228)),0,1)","v":1},{"$f":"IF(C228=0,\"\",COUNTIF($B$2:C228,1))","v":227},"Camp Fairbairn Outdoor Education Centre"]
[1854,"Camp Hill State Infants and Primary School",{"$f":"IF(ISERROR(SEARCH(Workplace_Name,Workplace_Lookup!B229)),0,1)","v":1},{"$f":"IF(C229=0,\"\",COUNTIF($B$2:C229,1))","v":228},"Camp Hill State Infants and Primary School"]
[1967,"Caningeraba State School",{"$f":"IF(ISERROR(SEARCH(Workplace_Name,Workplace_Lookup!B230)),0,1)","v":1},{"$f":"IF(C230=0,\"\",COUNTIF($B$2:C230,1))","v":229},"Caningeraba State School"]
[1476,"Cannon Hill State School",{"$f":"IF(ISERROR(SEARCH(Workplace_Name,Workplace_Lookup!B231)),0,1)","v":1},{"$f":"IF(C231=0,\"\",COUNTIF($B$2:C231,1))","v":230},"Cannon Hill State School"]
[589,"Cannonvale State School",{"$f":"IF(ISERROR(SEARCH(Workplace_Name,Workplace_Lookup!B232)),0,1)","v":1},{"$f":"IF(C232=0,\"\",COUNTIF($B$2:C232,1))","v":231},"Cannonvale State School"]
[566,"Canungra State School",{"$f":"IF(ISERROR(SEARCH(Workplace_Name,Workplace_Lookup!B233)),0,1)","v":1},{"$f":"IF(C233=0,\"\",COUNTIF($B$2:C233,1))","v":232},"Canungra State School"]
[5534,"Capalaba State College",{"$f":"IF(ISERROR(SEARCH(Workplace_Name,Workplace_Lookup!B234)),0,1)","v":1},{"$f":"IF(C234=0,\"\",COUNTIF($B$2:C234,1))","v":233},"Capalaba State College"]
[8009,"Cape York Aboriginal Australian Academy",{"$f":"IF(ISERROR(SEARCH(Workplace_Name,Workplace_Lookup!B235)),0,1)","v":1},{"$f":"IF(C235=0,\"\",COUNTIF($B$2:C235,1))","v":234},"Cape York Aboriginal Australian Academy"]
[2182,"Capella State High School",{"$f":"IF(ISERROR(SEARCH(Workplace_Name,Workplace_Lookup!B236)),0,1)","v":1},{"$f":"IF(C236=0,\"\",COUNTIF($B$2:C236,1))","v":235},"Capella State High School"]
[410,"Capella State School",{"$f":"IF(ISERROR(SEARCH(Workplace_Name,Workplace_Lookup!B237)),0,1)","v":1},{"$f":"IF(C237=0,\"\",COUNTIF($B$2:C237,1))","v":236},"Capella State School"]
[3612,"Capricornia (Emerald Campus) School of Distance Education",{"$f":"IF(ISERROR(SEARCH(Workplace_Name,Workplace_Lookup!B238)),0,1)","v":1},{"$f":"IF(C238=0,\"\",COUNTIF($B$2:C238,1))","v":237},"Capricornia (Emerald Campus) School of Distance Education"]
[3613,"Capricornia (Rockhampton Campus) School of Dist Ed",{"$f":"IF(ISERROR(SEARCH(Workplace_Name,Workplace_Lookup!B239)),0,1)","v":1},{"$f":"IF(C239=0,\"\",COUNTIF($B$2:C239,1))","v":238},"Capricornia (Rockhampton Campus) School of Dist Ed"]
[927,"Caravonica State School",{"$f":"IF(ISERROR(SEARCH(Workplace_Name,Workplace_Lookup!B240)),0,1)","v":1},{"$f":"IF(C240=0,\"\",COUNTIF($B$2:C240,1))","v":239},"Caravonica State School"]
[278,"Carbrook State School",{"$f":"IF(ISERROR(SEARCH(Workplace_Name,Workplace_Lookup!B241)),0,1)","v":1},{"$f":"IF(C241=0,\"\",COUNTIF($B$2:C241,1))","v":240},"Carbrook State School"]
[136,"Cardwell State School",{"$f":"IF(ISERROR(SEARCH(Workplace_Name,Workplace_Lookup!B242)),0,1)","v":1},{"$f":"IF(C242=0,\"\",COUNTIF($B$2:C242,1))","v":241},"Cardwell State School"]
[1552,"Carina State School",{"$f":"IF(ISERROR(SEARCH(Workplace_Name,Workplace_Lookup!B243)),0,1)","v":1},{"$f":"IF(C243=0,\"\",COUNTIF($B$2:C243,1))","v":242},"Carina State School"]
[1806,"Carmila State School",{"$f":"IF(ISERROR(SEARCH(Workplace_Name,Workplace_Lookup!B244)),0,1)","v":1},{"$f":"IF(C244=0,\"\",COUNTIF($B$2:C244,1))","v":243},"Carmila State School"]
[1044,"Carole Park State School",{"$f":"IF(ISERROR(SEARCH(Workplace_Name,Workplace_Lookup!B245)),0,1)","v":1},{"$f":"IF(C245=0,\"\",COUNTIF($B$2:C245,1))","v":244},"Carole Park State School"]
[2025,"Cavendish Road State High School",{"$f":"IF(ISERROR(SEARCH(Workplace_Name,Workplace_Lookup!B246)),0,1)","v":1},{"$f":"IF(C246=0,\"\",COUNTIF($B$2:C246,1))","v":245},"Cavendish Road State High School"]
[135,"Cawarral State School",{"$f":"IF(ISERROR(SEARCH(Workplace_Name,Workplace_Lookup!B247)),0,1)","v":1},{"$f":"IF(C247=0,\"\",COUNTIF($B$2:C247,1))","v":246},"Cawarral State School"]
[734,"Cecil Plains State School",{"$f":"IF(ISERROR(SEARCH(Workplace_Name,Workplace_Lookup!B248)),0,1)","v":1},{"$f":"IF(C248=0,\"\",COUNTIF($B$2:C248,1))","v":247},"Cecil Plains State School"]
[160,"Cedar Creek State School",{"$f":"IF(ISERROR(SEARCH(Workplace_Name,Workplace_Lookup!B249)),0,1)","v":1},{"$f":"IF(C249=0,\"\",COUNTIF($B$2:C249,1))","v":248},"Cedar Creek State School"]
[2121,"Centenary Heights State High School",{"$f":"IF(ISERROR(SEARCH(Workplace_Name,Workplace_Lookup!B250)),0,1)","v":1},{"$f":"IF(C250=0,\"\",COUNTIF($B$2:C250,1))","v":249},"Centenary Heights State High School"]
[1668,"Centenary State High School",{"$f":"IF(ISERROR(SEARCH(Workplace_Name,Workplace_Lookup!B251)),0,1)","v":1},{"$f":"IF(C251=0,\"\",COUNTIF($B$2:C251,1))","v":250},"Centenary State High School"]
["A040","Central Queensland Region - Emerald (Regional Services)",{"$f":"IF(ISERROR(SEARCH(Workplace_Name,Workplace_Lookup!B252)),0,1)","v":1},{"$f":"IF(C252=0,\"\",COUNTIF($B$2:C252,1))","v":251},"Central Queensland Region - Emerald (Regional Services)"]
["A046","Central Queensland Region - Gladstone (Regional Services)",{"$f":"IF(ISERROR(SEARCH(Workplace_Name,Workplace_Lookup!B253)),0,1)","v":1},{"$f":"IF(C253=0,\"\",COUNTIF($B$2:C253,1))","v":252},"Central Queensland Region - Gladstone (Regional Services)"]
[6651,"Central Queensland Region - Longreach (Regional Services)",{"$f":"IF(ISERROR(SEARCH(Workplace_Name,Workplace_Lookup!B254)),0,1)","v":1},{"$f":"IF(C254=0,\"\",COUNTIF($B$2:C254,1))","v":253},"Central Queensland Region - Longreach (Regional Services)"]
["A044","Central Queensland Region - Mackay (Regional Services)",{"$f":"IF(ISERROR(SEARCH(Workplace_Name,Workplace_Lookup!B255)),0,1)","v":1},{"$f":"IF(C255=0,\"\",COUNTIF($B$2:C255,1))","v":254},"Central Queensland Region - Mackay (Regional Services)"]
[6653,"Central Queensland Region - Rockhampton (State Schooling)",{"$f":"IF(ISERROR(SEARCH(Workplace_Name,Workplace_Lookup!B256)),0,1)","v":1},{"$f":"IF(C256=0,\"\",COUNTIF($B$2:C256,1))","v":255},"Central Queensland Region - Rockhampton (State Schooling)"]
[2282,"Chancellor State College",{"$f":"IF(ISERROR(SEARCH(Workplace_Name,Workplace_Lookup!B257)),0,1)","v":1},{"$f":"IF(C257=0,\"\",COUNTIF($B$2:C257,1))","v":256},"Chancellor State College"]
[1872,"Chapel Hill State School",{"$f":"IF(ISERROR(SEARCH(Workplace_Name,Workplace_Lookup!B258)),0,1)","v":1},{"$f":"IF(C258=0,\"\",COUNTIF($B$2:C258,1))","v":257},"Chapel Hill State School"]
[3602,"Charleville School of Distance Education",{"$f":"IF(ISERROR(SEARCH(Workplace_Name,Workplace_Lookup!B259)),0,1)","v":1},{"$f":"IF(C259=0,\"\",COUNTIF($B$2:C259,1))","v":258},"Charleville School of Distance Education"]
[2068,"Charleville State High School",{"$f":"IF(ISERROR(SEARCH(Workplace_Name,Workplace_Lookup!B260)),0,1)","v":1},{"$f":"IF(C260=0,\"\",COUNTIF($B$2:C260,1))","v":259},{"$f":"IFERROR(INDEX(B:B,MATCH(ROW(B259),D:D,0)),\"\")","v":"Charleville State High School"}]
[185,"Charleville State School",{"$f":"IF(ISERROR(SEARCH(Workplace_Name,Workplace_Lookup!B261)),0,1)","v":1},{"$f":"IF(C261=0,\"\",COUNTIF($B$2:C261,1))","v":260},"Charleville State School"]
[215,"Charters Towers Central State School",{"$f":"IF(ISERROR(SEARCH(Workplace_Name,Workplace_Lookup!B262)),0,1)","v":1},{"$f":"IF(C262=0,\"\",COUNTIF($B$2:C262,1))","v":261},"Charters Towers Central State School"]
[3610,"Charters Towers School of Distance Education",{"$f":"IF(ISERROR(SEARCH(Workplace_Name,Workplace_Lookup!B263)),0,1)","v":1},{"$f":"IF(C263=0,\"\",COUNTIF($B$2:C263,1))","v":262},"Charters Towers School of Distance Education"]
[2006,"Charters Towers State High School",{"$f":"IF(ISERROR(SEARCH(Workplace_Name,Workplace_Lookup!B264)),0,1)","v":1},{"$f":"IF(C264=0,\"\",COUNTIF($B$2:C264,1))","v":263},"Charters Towers State High School"]
[1924,"Chatswood Hills State School",{"$f":"IF(ISERROR(SEARCH(Workplace_Name,Workplace_Lookup!B265)),0,1)","v":1},{"$f":"IF(C265=0,\"\",COUNTIF($B$2:C265,1))","v":264},"Chatswood Hills State School"]
[915,"Chatsworth State School",{"$f":"IF(ISERROR(SEARCH(Workplace_Name,Workplace_Lookup!B266)),0,1)","v":1},{"$f":"IF(C266=0,\"\",COUNTIF($B$2:C266,1))","v":265},"Chatsworth State School"]
[677,"Chelona State School",{"$f":"IF(ISERROR(SEARCH(Workplace_Name,Workplace_Lookup!B267)),0,1)","v":1},{"$f":"IF(C267=0,\"\",COUNTIF($B$2:C267,1))","v":266},"Chelona State School"]
[989,"Cherbourg State School",{"$f":"IF(ISERROR(SEARCH(Workplace_Name,Workplace_Lookup!B268)),0,1)","v":1},{"$f":"IF(C268=0,\"\",COUNTIF($B$2:C268,1))","v":267},"Cherbourg State School"]
[1722,"Chevallum State School",{"$f":"IF(ISERROR(SEARCH(Workplace_Name,Workplace_Lookup!B269)),0,1)","v":1},{"$f":"IF(C269=0,\"\",COUNTIF($B$2:C269,1))","v":268},"Chevallum State School"]
[568,"Childers State School",{"$f":"IF(ISERROR(SEARCH(Workplace_Name,Workplace_Lookup!B270)),0,1)","v":1},{"$f":"IF(C270=0,\"\",COUNTIF($B$2:C270,1))","v":269},"Childers State School"]
[866,"Chillagoe State School",{"$f":"IF(ISERROR(SEARCH(Workplace_Name,Workplace_Lookup!B271)),0,1)","v":1},{"$f":"IF(C271=0,\"\",COUNTIF($B$2:C271,1))","v":270},"Chillagoe State School"]
[2087,"Chinchilla State High School",{"$f":"IF(ISERROR(SEARCH(Workplace_Name,Workplace_Lookup!B272)),0,1)","v":1},{"$f":"IF(C272=0,\"\",COUNTIF($B$2:C272,1))","v":271},"Chinchilla State High School"]
[244,"Chinchilla State School",{"$f":"IF(ISERROR(SEARCH(Workplace_Name,Workplace_Lookup!B273)),0,1)","v":1},{"$f":"IF(C273=0,\"\",COUNTIF($B$2:C273,1))","v":272},"Chinchilla State School"]
[1789,"Churchill State School",{"$f":"IF(ISERROR(SEARCH(Workplace_Name,Workplace_Lookup!B274)),0,1)","v":1},{"$f":"IF(C274=0,\"\",COUNTIF($B$2:C274,1))","v":273},"Churchill State School"]
[171,"Clare State School",{"$f":"IF(ISERROR(SEARCH(Workplace_Name,Workplace_Lookup!B275)),0,1)","v":1},{"$f":"IF(C275=0,\"\",COUNTIF($B$2:C275,1))","v":274},"Clare State School"]
[3066,"Claremont Special School",{"$f":"IF(ISERROR(SEARCH(Workplace_Name,Workplace_Lookup!B276)),0,1)","v":1},{"$f":"IF(C276=0,\"\",COUNTIF($B$2:C276,1))","v":275},"Claremont Special School"]
[1732,"Clarendon State School",{"$f":"IF(ISERROR(SEARCH(Workplace_Name,Workplace_Lookup!B277)),0,1)","v":1},{"$f":"IF(C277=0,\"\",COUNTIF($B$2:C277,1))","v":276},"Clarendon State School"]
[606,"Clarke Creek State School",{"$f":"IF(ISERROR(SEARCH(Workplace_Name,Workplace_Lookup!B278)),0,1)","v":1},{"$f":"IF(C278=0,\"\",COUNTIF($B$2:C278,1))","v":277},"Clarke Creek State School"]
[2185,"Clermont State High School",{"$f":"IF(ISERROR(SEARCH(Workplace_Name,Workplace_Lookup!B279)),0,1)","v":1},{"$f":"IF(C279=0,\"\",COUNTIF($B$2:C279,1))","v":278},"Clermont State High School"]
[21,"Clermont State School",{"$f":"IF(ISERROR(SEARCH(Workplace_Name,Workplace_Lookup!B280)),0,1)","v":1},{"$f":"IF(C280=0,\"\",COUNTIF($B$2:C280,1))","v":279},"Clermont State School"]
[2070,"Cleveland District State High School",{"$f":"IF(ISERROR(SEARCH(Workplace_Name,Workplace_Lookup!B281)),0,1)","v":1},{"$f":"IF(C281=0,\"\",COUNTIF($B$2:C281,1))","v":280},"Cleveland District State High School"]
[3160,"Cleveland Education and Training Centre",{"$f":"IF(ISERROR(SEARCH(Workplace_Name,Workplace_Lookup!B282)),0,1)","v":1},{"$f":"IF(C282=0,\"\",COUNTIF($B$2:C282,1))","v":281},"Cleveland Education and Training Centre"]
[22,"Cleveland State School",{"$f":"IF(ISERROR(SEARCH(Workplace_Name,Workplace_Lookup!B283)),0,1)","v":1},{"$f":"IF(C283=0,\"\",COUNTIF($B$2:C283,1))","v":282},"Cleveland State School"]
[3087,"Clifford Park Special School",{"$f":"IF(ISERROR(SEARCH(Workplace_Name,Workplace_Lookup!B284)),0,1)","v":1},{"$f":"IF(C284=0,\"\",COUNTIF($B$2:C284,1))","v":283},"Clifford Park Special School"]
[2111,"Clifton State High School",{"$f":"IF(ISERROR(SEARCH(Workplace_Name,Workplace_Lookup!B285)),0,1)","v":1},{"$f":"IF(C285=0,\"\",COUNTIF($B$2:C285,1))","v":284},"Clifton State High School"]
[687,"Clifton State School",{"$f":"IF(ISERROR(SEARCH(Workplace_Name,Workplace_Lookup!B286)),0,1)","v":1},{"$f":"IF(C286=0,\"\",COUNTIF($B$2:C286,1))","v":285},"Clifton State School"]
[172,"Clinton State School",{"$f":"IF(ISERROR(SEARCH(Workplace_Name,Workplace_Lookup!B287)),0,1)","v":1},{"$f":"IF(C287=0,\"\",COUNTIF($B$2:C287,1))","v":286},"Clinton State School"]
[411,"Cloncurry State School P-12",{"$f":"IF(ISERROR(SEARCH(Workplace_Name,Workplace_Lookup!B288)),0,1)","v":1},{"$f":"IF(C288=0,\"\",COUNTIF($B$2:C288,1))","v":287},"Cloncurry State School P-12"]
[2091,"Clontarf Beach State High School",{"$f":"IF(ISERROR(SEARCH(Workplace_Name,Workplace_Lookup!B289)),0,1)","v":1},{"$f":"IF(C289=0,\"\",COUNTIF($B$2:C289,1))","v":288},"Clontarf Beach State High School"]
[162,"Clontarf Beach State School",{"$f":"IF(ISERROR(SEARCH(Workplace_Name,Workplace_Lookup!B290)),0,1)","v":1},{"$f":"IF(C290=0,\"\",COUNTIF($B$2:C290,1))","v":289},"Clontarf Beach State School"]
[2345,"Clover Hill State School",{"$f":"IF(ISERROR(SEARCH(Workplace_Name,Workplace_Lookup!B291)),0,1)","v":1},{"$f":"IF(C291=0,\"\",COUNTIF($B$2:C291,1))","v":290},"Clover Hill State School"]
[1254,"Cloyna State School",{"$f":"IF(ISERROR(SEARCH(Workplace_Name,Workplace_Lookup!B292)),0,1)","v":1},{"$f":"IF(C292=0,\"\",COUNTIF($B$2:C292,1))","v":291},"Cloyna State School"]
[1225,"Coalstoun Lakes State School",{"$f":"IF(ISERROR(SEARCH(Workplace_Name,Workplace_Lookup!B293)),0,1)","v":1},{"$f":"IF(C293=0,\"\",COUNTIF($B$2:C293,1))","v":292},"Coalstoun Lakes State School"]
[1480,"Coen Campus of CYAAA",{"$f":"IF(ISERROR(SEARCH(Workplace_Name,Workplace_Lookup!B294)),0,1)","v":1},{"$f":"IF(C294=0,\"\",COUNTIF($B$2:C294,1))","v":293},"Coen Campus of CYAAA"]
[1956,"Collingwood Park State School",{"$f":"IF(ISERROR(SEARCH(Workplace_Name,Workplace_Lookup!B295)),0,1)","v":1},{"$f":"IF(C295=0,\"\",COUNTIF($B$2:C295,1))","v":294},"Collingwood Park State School"]
[2171,"Collinsville State High School",{"$f":"IF(ISERROR(SEARCH(Workplace_Name,Workplace_Lookup!B296)),0,1)","v":1},{"$f":"IF(C296=0,\"\",COUNTIF($B$2:C296,1))","v":295},"Collinsville State High School"]
[1691,"Collinsville State School",{"$f":"IF(ISERROR(SEARCH(Workplace_Name,Workplace_Lookup!B297)),0,1)","v":1},{"$f":"IF(C297=0,\"\",COUNTIF($B$2:C297,1))","v":296},"Collinsville State School"]
[3564,"Columboola Environmental Education Centre",{"$f":"IF(ISERROR(SEARCH(Workplace_Name,Workplace_Lookup!B298)),0,1)","v":1},{"$f":"IF(C298=0,\"\",COUNTIF($B$2:C298,1))","v":297},"Columboola Environmental Education Centre"]
[173,"Comet State School",{"$f":"IF(ISERROR(SEARCH(Workplace_Name,Workplace_Lookup!B299)),0,1)","v":1},{"$f":"IF(C299=0,\"\",COUNTIF($B$2:C299,1))","v":298},"Comet State School"]
[24,"Condamine State School",{"$f":"IF(ISERROR(SEARCH(Workplace_Name,Workplace_Lookup!B300)),0,1)","v":1},{"$f":"IF(C300=0,\"\",COUNTIF($B$2:C300,1))","v":299},"Condamine State School"]
[439,"Coningsby State School",{"$f":"IF(ISERROR(SEARCH(Workplace_Name,Workplace_Lookup!B301)),0,1)","v":1},{"$f":"IF(C301=0,\"\",COUNTIF($B$2:C301,1))","v":300},"Coningsby State School"]
[1352,"Conondale State School",{"$f":"IF(ISERROR(SEARCH(Workplace_Name,Workplace_Lookup!B302)),0,1)","v":1},{"$f":"IF(C302=0,\"\",COUNTIF($B$2:C302,1))","v":301},"Conondale State School"]
[177,"Cooktown State School",{"$f":"IF(ISERROR(SEARCH(Workplace_Name,Workplace_Lookup!B303)),0,1)","v":1},{"$f":"IF(C303=0,\"\",COUNTIF($B$2:C303,1))","v":302},"Cooktown State School"]
[638,"Coolabunia State School",{"$f":"IF(ISERROR(SEARCH(Workplace_Name,Workplace_Lookup!B304)),0,1)","v":1},{"$f":"IF(C304=0,\"\",COUNTIF($B$2:C304,1))","v":303},"Coolabunia State School"]
[1630,"Coolangatta State School",{"$f":"IF(ISERROR(SEARCH(Workplace_Name,Workplace_Lookup!B305)),0,1)","v":1},{"$f":"IF(C305=0,\"\",COUNTIF($B$2:C305,1))","v":304},"Coolangatta State School"]
[1927,"Coolnwynpin State School",{"$f":"IF(ISERROR(SEARCH(Workplace_Name,Workplace_Lookup!B306)),0,1)","v":1},{"$f":"IF(C306=0,\"\",COUNTIF($B$2:C306,1))","v":305},"Coolnwynpin State School"]
[2165,"Coolum State High School",{"$f":"IF(ISERROR(SEARCH(Workplace_Name,Workplace_Lookup!B307)),0,1)","v":1},{"$f":"IF(C307=0,\"\",COUNTIF($B$2:C307,1))","v":306},"Coolum State High School"]
[1571,"Coolum State School",{"$f":"IF(ISERROR(SEARCH(Workplace_Name,Workplace_Lookup!B308)),0,1)","v":1},{"$f":"IF(C308=0,\"\",COUNTIF($B$2:C308,1))","v":307},"Coolum State School"]
[2166,"Coombabah State High School",{"$f":"IF(ISERROR(SEARCH(Workplace_Name,Workplace_Lookup!B309)),0,1)","v":1},{"$f":"IF(C309=0,\"\",COUNTIF($B$2:C309,1))","v":308},"Coombabah State High School"]
[1909,"Coombabah State School",{"$f":"IF(ISERROR(SEARCH(Workplace_Name,Workplace_Lookup!B310)),0,1)","v":1},{"$f":"IF(C310=0,\"\",COUNTIF($B$2:C310,1))","v":309},"Coombabah State School"]
[7122,"Coomera Rivers State School",{"$f":"IF(ISERROR(SEARCH(Workplace_Name,Workplace_Lookup!B311)),0,1)","v":1},{"$f":"IF(C311=0,\"\",COUNTIF($B$2:C311,1))","v":310},"Coomera Rivers State School"]
[5730,"Coomera Springs State School",{"$f":"IF(ISERROR(SEARCH(Workplace_Name,Workplace_Lookup!B312)),0,1)","v":1},{"$f":"IF(C312=0,\"\",COUNTIF($B$2:C312,1))","v":311},"Coomera Springs State School"]
[124,"Coomera State School",{"$f":"IF(ISERROR(SEARCH(Workplace_Name,Workplace_Lookup!B313)),0,1)","v":1},{"$f":"IF(C313=0,\"\",COUNTIF($B$2:C313,1))","v":312},"Coomera State School"]
["B016","Coomera State Special School",{"$f":"IF(ISERROR(SEARCH(Workplace_Name,Workplace_Lookup!B314)),0,1)","v":1},{"$f":"IF(C314=0,\"\",COUNTIF($B$2:C314,1))","v":313},"Coomera State Special School"]
[1359,"Coominya State School",{"$f":"IF(ISERROR(SEARCH(Workplace_Name,Workplace_Lookup!B315)),0,1)","v":1},{"$f":"IF(C315=0,\"\",COUNTIF($B$2:C315,1))","v":314},"Coominya State School"]
[1247,"Coopers Plains State School",{"$f":"IF(ISERROR(SEARCH(Workplace_Name,Workplace_Lookup!B316)),0,1)","v":1},{"$f":"IF(C316=0,\"\",COUNTIF($B$2:C316,1))","v":315},"Coopers Plains State School"]
[602,"Cooran State School",{"$f":"IF(ISERROR(SEARCH(Workplace_Name,Workplace_Lookup!B317)),0,1)","v":1},{"$f":"IF(C317=0,\"\",COUNTIF($B$2:C317,1))","v":316},"Cooran State School"]
[1165,"Cooroy State School",{"$f":"IF(ISERROR(SEARCH(Workplace_Name,Workplace_Lookup!B318)),0,1)","v":1},{"$f":"IF(C318=0,\"\",COUNTIF($B$2:C318,1))","v":317},"Cooroy State School"]
[2077,"Coorparoo Secondary College",{"$f":"IF(ISERROR(SEARCH(Workplace_Name,Workplace_Lookup!B319)),0,1)","v":1},{"$f":"IF(C319=0,\"\",COUNTIF($B$2:C319,1))","v":318},"Coorparoo Secondary College"]
[219,"Coorparoo State School",{"$f":"IF(ISERROR(SEARCH(Workplace_Name,Workplace_Lookup!B320)),0,1)","v":1},{"$f":"IF(C320=0,\"\",COUNTIF($B$2:C320,1))","v":319},"Coorparoo State School"]
[32,"Coowonga State School",{"$f":"IF(ISERROR(SEARCH(Workplace_Name,Workplace_Lookup!B321)),0,1)","v":1},{"$f":"IF(C321=0,\"\",COUNTIF($B$2:C321,1))","v":320},"Coowonga State School"]
[1084,"Cooyar State School",{"$f":"IF(ISERROR(SEARCH(Workplace_Name,Workplace_Lookup!B322)),0,1)","v":1},{"$f":"IF(C322=0,\"\",COUNTIF($B$2:C322,1))","v":321},"Cooyar State School"]
[1898,"Coppabella State School",{"$f":"IF(ISERROR(SEARCH(Workplace_Name,Workplace_Lookup!B323)),0,1)","v":1},{"$f":"IF(C323=0,\"\",COUNTIF($B$2:C323,1))","v":322},"Coppabella State School"]
[117,"Cordalba State School",{"$f":"IF(ISERROR(SEARCH(Workplace_Name,Workplace_Lookup!B324)),0,1)","v":1},{"$f":"IF(C324=0,\"\",COUNTIF($B$2:C324,1))","v":323},{"$f":"IFERROR(INDEX(B:B,MATCH(ROW(B323),D:D,0)),\"\")","v":"Cordalba State School"}]
[2055,"Corinda State High School",{"$f":"IF(ISERROR(SEARCH(Workplace_Name,Workplace_Lookup!B325)),0,1)","v":1},{"$f":"IF(C325=0,\"\",COUNTIF($B$2:C325,1))","v":324},"Corinda State High School"]
[1025,"Corinda State School",{"$f":"IF(ISERROR(SEARCH(Workplace_Name,Workplace_Lookup!B326)),0,1)","v":1},{"$f":"IF(C326=0,\"\",COUNTIF($B$2:C326,1))","v":325},"Corinda State School"]
[2023,"Craigslea State High School",{"$f":"IF(ISERROR(SEARCH(Workplace_Name,Workplace_Lookup!B327)),0,1)","v":1},{"$f":"IF(C327=0,\"\",COUNTIF($B$2:C327,1))","v":326},"Craigslea State High School"]
[60,"Craigslea State School",{"$f":"IF(ISERROR(SEARCH(Workplace_Name,Workplace_Lookup!B328)),0,1)","v":1},{"$f":"IF(C328=0,\"\",COUNTIF($B$2:C328,1))","v":327},"Craigslea State School"]
[1907,"Cranbrook State School",{"$f":"IF(ISERROR(SEARCH(Workplace_Name,Workplace_Lookup!B329)),0,1)","v":1},{"$f":"IF(C329=0,\"\",COUNTIF($B$2:C329,1))","v":328},"Cranbrook State School"]
[399,"Crawford State School",{"$f":"IF(ISERROR(SEARCH(Workplace_Name,Workplace_Lookup!B330)),0,1)","v":1},{"$f":"IF(C330=0,\"\",COUNTIF($B$2:C330,1))","v":329},"Crawford State School"]
[762,"Crescent Lagoon State School",{"$f":"IF(ISERROR(SEARCH(Workplace_Name,Workplace_Lookup!B331)),0,1)","v":1},{"$f":"IF(C331=0,\"\",COUNTIF($B$2:C331,1))","v":330},"Crescent Lagoon State School"]
[1928,"Crestmead State School",{"$f":"IF(ISERROR(SEARCH(Workplace_Name,Workplace_Lookup!B332)),0,1)","v":1},{"$f":"IF(C332=0,\"\",COUNTIF($B$2:C332,1))","v":331},"Crestmead State School"]
[293,"Crow's Nest State School",{"$f":"IF(ISERROR(SEARCH(Workplace_Name,Workplace_Lookup!B333)),0,1)","v":1},{"$f":"IF(C333=0,\"\",COUNTIF($B$2:C333,1))","v":332},"Crow's Nest State School"]
[165,"Croydon State School",{"$f":"IF(ISERROR(SEARCH(Workplace_Name,Workplace_Lookup!B334)),0,1)","v":1},{"$f":"IF(C334=0,\"\",COUNTIF($B$2:C334,1))","v":333},"Croydon State School"]
[289,"Cunnamulla P-12 State School",{"$f":"IF(ISERROR(SEARCH(Workplace_Name,Workplace_Lookup!B335)),0,1)","v":1},{"$f":"IF(C335=0,\"\",COUNTIF($B$2:C335,1))","v":334},"Cunnamulla P-12 State School"]
[355,"Currajong State School",{"$f":"IF(ISERROR(SEARCH(Workplace_Name,Workplace_Lookup!B336)),0,1)","v":1},{"$f":"IF(C336=0,\"\",COUNTIF($B$2:C336,1))","v":335},"Currajong State School"]
[3054,"Currimundi Special School",{"$f":"IF(ISERROR(SEARCH(Workplace_Name,Workplace_Lookup!B337)),0,1)","v":1},{"$f":"IF(C337=0,\"\",COUNTIF($B$2:C337,1))","v":336},"Currimundi Special School"]
[1868,"Currimundi State School",{"$f":"IF(ISERROR(SEARCH(Workplace_Name,Workplace_Lookup!B338)),0,1)","v":1},{"$f":"IF(C338=0,\"\",COUNTIF($B$2:C338,1))","v":337},"Currimundi State School"]
[3043,"Currumbin Community Special School",{"$f":"IF(ISERROR(SEARCH(Workplace_Name,Workplace_Lookup!B339)),0,1)","v":1},{"$f":"IF(C339=0,\"\",COUNTIF($B$2:C339,1))","v":338},"Currumbin Community Special School"]
[1168,"Currumbin State School",{"$f":"IF(ISERROR(SEARCH(Workplace_Name,Workplace_Lookup!B340)),0,1)","v":1},{"$f":"IF(C340=0,\"\",COUNTIF($B$2:C340,1))","v":339},"Currumbin State School"]
[775,"Currumbin Valley State School",{"$f":"IF(ISERROR(SEARCH(Workplace_Name,Workplace_Lookup!B341)),0,1)","v":1},{"$f":"IF(C341=0,\"\",COUNTIF($B$2:C341,1))","v":340},"Currumbin Valley State School"]
[892,"Dagun State School",{"$f":"IF(ISERROR(SEARCH(Workplace_Name,Workplace_Lookup!B342)),0,1)","v":1},{"$f":"IF(C342=0,\"\",COUNTIF($B$2:C342,1))","v":341},"Dagun State School"]
[1022,"Daintree State School",{"$f":"IF(ISERROR(SEARCH(Workplace_Name,Workplace_Lookup!B343)),0,1)","v":1},{"$f":"IF(C343=0,\"\",COUNTIF($B$2:C343,1))","v":342},"Daintree State School"]
[99,"Daisy Hill State School",{"$f":"IF(ISERROR(SEARCH(Workplace_Name,Workplace_Lookup!B344)),0,1)","v":1},{"$f":"IF(C344=0,\"\",COUNTIF($B$2:C344,1))","v":343},"Daisy Hill State School"]
[1670,"Dajarra State School",{"$f":"IF(ISERROR(SEARCH(Workplace_Name,Workplace_Lookup!B345)),0,1)","v":1},{"$f":"IF(C345=0,\"\",COUNTIF($B$2:C345,1))","v":344},"Dajarra State School"]
[2142,"Dakabin State High School",{"$f":"IF(ISERROR(SEARCH(Workplace_Name,Workplace_Lookup!B346)),0,1)","v":1},{"$f":"IF(C346=0,\"\",COUNTIF($B$2:C346,1))","v":345},"Dakabin State High School"]
[1988,"Dakabin State School",{"$f":"IF(ISERROR(SEARCH(Workplace_Name,Workplace_Lookup!B347)),0,1)","v":1},{"$f":"IF(C347=0,\"\",COUNTIF($B$2:C347,1))","v":346},"Dakabin State School"]
[671,"Dalby South State School",{"$f":"IF(ISERROR(SEARCH(Workplace_Name,Workplace_Lookup!B348)),0,1)","v":1},{"$f":"IF(C348=0,\"\",COUNTIF($B$2:C348,1))","v":347},"Dalby South State School"]
[2033,"Dalby State High School",{"$f":"IF(ISERROR(SEARCH(Workplace_Name,Workplace_Lookup!B349)),0,1)","v":1},{"$f":"IF(C349=0,\"\",COUNTIF($B$2:C349,1))","v":348},"Dalby State High School"]
[7362,"Dalby State High School - Bunya Campus",{"$f":"IF(ISERROR(SEARCH(Workplace_Name,Workplace_Lookup!B350)),0,1)","v":1},{"$f":"IF(C350=0,\"\",COUNTIF($B$2:C350,1))","v":349},"Dalby State High School - Bunya Campus"]
[7596,"Dalby State High School - Student Residential",{"$f":"IF(ISERROR(SEARCH(Workplace_Name,Workplace_Lookup!B351)),0,1)","v":1},{"$f":"IF(C351=0,\"\",COUNTIF($B$2:C351,1))","v":350},"Dalby State High School - Student Residential"]
[28,"Dalby State School",{"$f":"IF(ISERROR(SEARCH(Workplace_Name,Workplace_Lookup!B352)),0,1)","v":1},{"$f":"IF(C352=0,\"\",COUNTIF($B$2:C352,1))","v":351},"Dalby State School"]
[950,"Dallarnil State School",{"$f":"IF(ISERROR(SEARCH(Workplace_Name,Workplace_Lookup!B353)),0,1)","v":1},{"$f":"IF(C353=0,\"\",COUNTIF($B$2:C353,1))","v":352},"Dallarnil State School"]
[9679,"Dalrymple Trade Training Centre",{"$f":"IF(ISERROR(SEARCH(Workplace_Name,Workplace_Lookup!B354)),0,1)","v":1},{"$f":"IF(C354=0,\"\",COUNTIF($B$2:C354,1))","v":353},"Dalrymple Trade Training Centre"]
[318,"Dalveen State School",{"$f":"IF(ISERROR(SEARCH(Workplace_Name,Workplace_Lookup!B355)),0,1)","v":1},{"$f":"IF(C355=0,\"\",COUNTIF($B$2:C355,1))","v":354},"Dalveen State School"]
[3581,"Daradgee Environmental Education Centre",{"$f":"IF(ISERROR(SEARCH(Workplace_Name,Workplace_Lookup!B356)),0,1)","v":1},{"$f":"IF(C356=0,\"\",COUNTIF($B$2:C356,1))","v":355},"Daradgee Environmental Education Centre"]
[1900,"Darling Heights State School",{"$f":"IF(ISERROR(SEARCH(Workplace_Name,Workplace_Lookup!B357)),0,1)","v":1},{"$f":"IF(C357=0,\"\",COUNTIF($B$2:C357,1))","v":356},"Darling Heights State School"]
[3025,"Darling Point Special School",{"$f":"IF(ISERROR(SEARCH(Workplace_Name,Workplace_Lookup!B358)),0,1)","v":1},{"$f":"IF(C358=0,\"\",COUNTIF($B$2:C358,1))","v":357},"Darling Point Special School"]
[520,"Darlington State School",{"$f":"IF(ISERROR(SEARCH(Workplace_Name,Workplace_Lookup!B359)),0,1)","v":1},{"$f":"IF(C359=0,\"\",COUNTIF($B$2:C359,1))","v":358},"Darlington State School"]
[1520,"Darra State School",{"$f":"IF(ISERROR(SEARCH(Workplace_Name,Workplace_Lookup!B360)),0,1)","v":1},{"$f":"IF(C360=0,\"\",COUNTIF($B$2:C360,1))","v":359},"Darra State School"]
[191,"Dayboro State School",{"$f":"IF(ISERROR(SEARCH(Workplace_Name,Workplace_Lookup!B361)),0,1)","v":1},{"$f":"IF(C361=0,\"\",COUNTIF($B$2:C361,1))","v":360},"Dayboro State School"]
[5631,"DDSW Region - Chinchilla Office",{"$f":"IF(ISERROR(SEARCH(Workplace_Name,Workplace_Lookup!B362)),0,1)","v":1},{"$f":"IF(C362=0,\"\",COUNTIF($B$2:C362,1))","v":361},"DDSW Region - Chinchilla Office"]
[6657,"DDSW Region - Kingaroy Office",{"$f":"IF(ISERROR(SEARCH(Workplace_Name,Workplace_Lookup!B363)),0,1)","v":1},{"$f":"IF(C363=0,\"\",COUNTIF($B$2:C363,1))","v":362},"DDSW Region - Kingaroy Office"]
[6659,"DDSW Region - Roma Office",{"$f":"IF(ISERROR(SEARCH(Workplace_Name,Workplace_Lookup!B364)),0,1)","v":1},{"$f":"IF(C364=0,\"\",COUNTIF($B$2:C364,1))","v":363},"DDSW Region - Roma Office"]
[6655,"DDSW Region - Toowoomba Office",{"$f":"IF(ISERROR(SEARCH(Workplace_Name,Workplace_Lookup!B365)),0,1)","v":1},{"$f":"IF(C365=0,\"\",COUNTIF($B$2:C365,1))","v":364},"DDSW Region - Toowoomba Office"]
[6658,"DDSW Region - Warwick Office",{"$f":"IF(ISERROR(SEARCH(Workplace_Name,Workplace_Lookup!B366)),0,1)","v":1},{"$f":"IF(C366=0,\"\",COUNTIF($B$2:C366,1))","v":365},"DDSW Region - Warwick Office"]
[1884,"Deception Bay North State School",{"$f":"IF(ISERROR(SEARCH(Workplace_Name,Workplace_Lookup!B367)),0,1)","v":1},{"$f":"IF(C367=0,\"\",COUNTIF($B$2:C367,1))","v":366},"Deception Bay North State School"]
[2107,"Deception Bay State High School",{"$f":"IF(ISERROR(SEARCH(Workplace_Name,Workplace_Lookup!B368)),0,1)","v":1},{"$f":"IF(C368=0,\"\",COUNTIF($B$2:C368,1))","v":367},"Deception Bay State High School"]
[237,"Deception Bay State School",{"$f":"IF(ISERROR(SEARCH(Workplace_Name,Workplace_Lookup!B369)),0,1)","v":1},{"$f":"IF(C369=0,\"\",COUNTIF($B$2:C369,1))","v":368},"Deception Bay State School"]
[9916,"Deebing Heights State School",{"$f":"IF(ISERROR(SEARCH(Workplace_Name,Workplace_Lookup!B370)),0,1)","v":1},{"$f":"IF(C370=0,\"\",COUNTIF($B$2:C370,1))","v":369},"Deebing Heights State School"]
[683,"Delaneys Creek State School",{"$f":"IF(ISERROR(SEARCH(Workplace_Name,Workplace_Lookup!B371)),0,1)","v":1},{"$f":"IF(C371=0,\"\",COUNTIF($B$2:C371,1))","v":370},"Delaneys Creek State School"]
["B120","Denise Kable Youth Services Centre",{"$f":"IF(ISERROR(SEARCH(Workplace_Name,Workplace_Lookup!B372)),0,1)","v":1},{"$f":"IF(C372=0,\"\",COUNTIF($B$2:C372,1))","v":371},"Denise Kable Youth Services Centre"]
[392,"Denison State School",{"$f":"IF(ISERROR(SEARCH(Workplace_Name,Workplace_Lookup!B373)),0,1)","v":1},{"$f":"IF(C373=0,\"\",COUNTIF($B$2:C373,1))","v":372},"Denison State School"]
[837,"Depot Hill State School",{"$f":"IF(ISERROR(SEARCH(Workplace_Name,Workplace_Lookup!B374)),0,1)","v":1},{"$f":"IF(C374=0,\"\",COUNTIF($B$2:C374,1))","v":373},"Depot Hill State School"]
[1226,"Dimbulah State School",{"$f":"IF(ISERROR(SEARCH(Workplace_Name,Workplace_Lookup!B375)),0,1)","v":1},{"$f":"IF(C375=0,\"\",COUNTIF($B$2:C375,1))","v":374},"Dimbulah State School"]
[266,"Dingo State School",{"$f":"IF(ISERROR(SEARCH(Workplace_Name,Workplace_Lookup!B376)),0,1)","v":1},{"$f":"IF(C376=0,\"\",COUNTIF($B$2:C376,1))","v":375},"Dingo State School"]
[1001,"Dirranbandi P-10 State School",{"$f":"IF(ISERROR(SEARCH(Workplace_Name,Workplace_Lookup!B377)),0,1)","v":1},{"$f":"IF(C377=0,\"\",COUNTIF($B$2:C377,1))","v":376},"Dirranbandi P-10 State School"]
[330,"Doomadgee State School",{"$f":"IF(ISERROR(SEARCH(Workplace_Name,Workplace_Lookup!B378)),0,1)","v":1},{"$f":"IF(C378=0,\"\",COUNTIF($B$2:C378,1))","v":377},"Doomadgee State School"]
[31,"Drayton State School",{"$f":"IF(ISERROR(SEARCH(Workplace_Name,Workplace_Lookup!B379)),0,1)","v":1},{"$f":"IF(C379=0,\"\",COUNTIF($B$2:C379,1))","v":378},"Drayton State School"]
[889,"Drillham State School",{"$f":"IF(ISERROR(SEARCH(Workplace_Name,Workplace_Lookup!B380)),0,1)","v":1},{"$f":"IF(C380=0,\"\",COUNTIF($B$2:C380,1))","v":379},"Drillham State School"]
[342,"Duaringa State School",{"$f":"IF(ISERROR(SEARCH(Workplace_Name,Workplace_Lookup!B381)),0,1)","v":1},{"$f":"IF(C381=0,\"\",COUNTIF($B$2:C381,1))","v":380},"Duaringa State School"]
[1170,"Dulacca State School",{"$f":"IF(ISERROR(SEARCH(Workplace_Name,Workplace_Lookup!B382)),0,1)","v":1},{"$f":"IF(C382=0,\"\",COUNTIF($B$2:C382,1))","v":381},"Dulacca State School"]
[1779,"Dundula State School",{"$f":"IF(ISERROR(SEARCH(Workplace_Name,Workplace_Lookup!B383)),0,1)","v":1},{"$f":"IF(C383=0,\"\",COUNTIF($B$2:C383,1))","v":382},"Dundula State School"]
[934,"Dunkeld State School",{"$f":"IF(ISERROR(SEARCH(Workplace_Name,Workplace_Lookup!B384)),0,1)","v":1},{"$f":"IF(C384=0,\"\",COUNTIF($B$2:C384,1))","v":383},"Dunkeld State School"]
[784,"Dunwich State School",{"$f":"IF(ISERROR(SEARCH(Workplace_Name,Workplace_Lookup!B385)),0,1)","v":1},{"$f":"IF(C385=0,\"\",COUNTIF($B$2:C385,1))","v":384},"Dunwich State School"]
[959,"Durack State School",{"$f":"IF(ISERROR(SEARCH(Workplace_Name,Workplace_Lookup!B386)),0,1)","v":1},{"$f":"IF(C386=0,\"\",COUNTIF($B$2:C386,1))","v":385},"Durack State School"]
[1667,"Durong South State School",{"$f":"IF(ISERROR(SEARCH(Workplace_Name,Workplace_Lookup!B387)),0,1)","v":1},{"$f":"IF(C387=0,\"\",COUNTIF($B$2:C387,1))","v":386},"Durong South State School"]
[506,"Dutton Park State School",{"$f":"IF(ISERROR(SEARCH(Workplace_Name,Workplace_Lookup!B388)),0,1)","v":1},{"$f":"IF(C388=0,\"\",COUNTIF($B$2:C388,1))","v":387},{"$f":"IFERROR(INDEX(B:B,MATCH(ROW(B387),D:D,0)),\"\")","v":"Dutton Park State School"}]
[2156,"Dysart State High School",{"$f":"IF(ISERROR(SEARCH(Workplace_Name,Workplace_Lookup!B389)),0,1)","v":1},{"$f":"IF(C389=0,\"\",COUNTIF($B$2:C389,1))","v":388},"Dysart State High School"]
[97,"Dysart State School",{"$f":"IF(ISERROR(SEARCH(Workplace_Name,Workplace_Lookup!B390)),0,1)","v":1},{"$f":"IF(C390=0,\"\",COUNTIF($B$2:C390,1))","v":389},"Dysart State School"]
[726,"Eagle Junction State School",{"$f":"IF(ISERROR(SEARCH(Workplace_Name,Workplace_Lookup!B391)),0,1)","v":1},{"$f":"IF(C391=0,\"\",COUNTIF($B$2:C391,1))","v":390},"Eagle Junction State School"]
[3711,"Eagleby Learning Centre - Centre for Continuing Secondary Education",{"$f":"IF(ISERROR(SEARCH(Workplace_Name,Workplace_Lookup!B392)),0,1)","v":1},{"$f":"IF(C392=0,\"\",COUNTIF($B$2:C392,1))","v":391},"Eagleby Learning Centre - Centre for Continuing Secondary Education"]
[1876,"Eagleby South State School",{"$f":"IF(ISERROR(SEARCH(Workplace_Name,Workplace_Lookup!B393)),0,1)","v":1},{"$f":"IF(C393=0,\"\",COUNTIF($B$2:C393,1))","v":392},"Eagleby South State School"]
[1974,"Eagleby State School",{"$f":"IF(ISERROR(SEARCH(Workplace_Name,Workplace_Lookup!B394)),0,1)","v":1},{"$f":"IF(C394=0,\"\",COUNTIF($B$2:C394,1))","v":393},"Eagleby State School"]
[5180,"Earnshaw State College",{"$f":"IF(ISERROR(SEARCH(Workplace_Name,Workplace_Lookup!B395)),0,1)","v":1},{"$f":"IF(C395=0,\"\",COUNTIF($B$2:C395,1))","v":394},"Earnshaw State College"]
[908,"East Ayr State School",{"$f":"IF(ISERROR(SEARCH(Workplace_Name,Workplace_Lookup!B396)),0,1)","v":1},{"$f":"IF(C396=0,\"\",COUNTIF($B$2:C396,1))","v":395},"East Ayr State School"]
[877,"East Brisbane State School",{"$f":"IF(ISERROR(SEARCH(Workplace_Name,Workplace_Lookup!B397)),0,1)","v":1},{"$f":"IF(C397=0,\"\",COUNTIF($B$2:C397,1))","v":396},"East Brisbane State School"]
[593,"Eatons Hill State School",{"$f":"IF(ISERROR(SEARCH(Workplace_Name,Workplace_Lookup!B398)),0,1)","v":1},{"$f":"IF(C398=0,\"\",COUNTIF($B$2:C398,1))","v":397},"Eatons Hill State School"]
[301,"Edens Landing State School",{"$f":"IF(ISERROR(SEARCH(Workplace_Name,Workplace_Lookup!B399)),0,1)","v":1},{"$f":"IF(C399=0,\"\",COUNTIF($B$2:C399,1))","v":398},"Edens Landing State School"]
[235,"Edge Hill State School",{"$f":"IF(ISERROR(SEARCH(Workplace_Name,Workplace_Lookup!B400)),0,1)","v":1},{"$f":"IF(C400=0,\"\",COUNTIF($B$2:C400,1))","v":399},"Edge Hill State School"]
[581,"Eidsvold State School",{"$f":"IF(ISERROR(SEARCH(Workplace_Name,Workplace_Lookup!B401)),0,1)","v":1},{"$f":"IF(C401=0,\"\",COUNTIF($B$2:C401,1))","v":400},"Eidsvold State School"]
[34,"Eight Mile Plains State School",{"$f":"IF(ISERROR(SEARCH(Workplace_Name,Workplace_Lookup!B402)),0,1)","v":1},{"$f":"IF(C402=0,\"\",COUNTIF($B$2:C402,1))","v":401},"Eight Mile Plains State School"]
[545,"Eimeo Road State School",{"$f":"IF(ISERROR(SEARCH(Workplace_Name,Workplace_Lookup!B403)),0,1)","v":1},{"$f":"IF(C403=0,\"\",COUNTIF($B$2:C403,1))","v":402},"Eimeo Road State School"]
[1758,"El Arish State School",{"$f":"IF(ISERROR(SEARCH(Workplace_Name,Workplace_Lookup!B404)),0,1)","v":1},{"$f":"IF(C404=0,\"\",COUNTIF($B$2:C404,1))","v":403},"El Arish State School"]
[2183,"Elanora State High School",{"$f":"IF(ISERROR(SEARCH(Workplace_Name,Workplace_Lookup!B405)),0,1)","v":1},{"$f":"IF(C405=0,\"\",COUNTIF($B$2:C405,1))","v":404},"Elanora State High School"]
[1923,"Elanora State School",{"$f":"IF(ISERROR(SEARCH(Workplace_Name,Workplace_Lookup!B406)),0,1)","v":1},{"$f":"IF(C406=0,\"\",COUNTIF($B$2:C406,1))","v":405},"Elanora State School"]
[953,"Elimbah State School",{"$f":"IF(ISERROR(SEARCH(Workplace_Name,Workplace_Lookup!B407)),0,1)","v":1},{"$f":"IF(C407=0,\"\",COUNTIF($B$2:C407,1))","v":406},"Elimbah State School"]
[1347,"Elliott Heads State School",{"$f":"IF(ISERROR(SEARCH(Workplace_Name,Workplace_Lookup!B408)),0,1)","v":1},{"$f":"IF(C408=0,\"\",COUNTIF($B$2:C408,1))","v":407},"Elliott Heads State School"]
[1904,"Emerald North State School",{"$f":"IF(ISERROR(SEARCH(Workplace_Name,Workplace_Lookup!B409)),0,1)","v":1},{"$f":"IF(C409=0,\"\",COUNTIF($B$2:C409,1))","v":408},"Emerald North State School"]
[2122,"Emerald State High School",{"$f":"IF(ISERROR(SEARCH(Workplace_Name,Workplace_Lookup!B410)),0,1)","v":1},{"$f":"IF(C410=0,\"\",COUNTIF($B$2:C410,1))","v":409},"Emerald State High School"]
[354,"Emerald State School",{"$f":"IF(ISERROR(SEARCH(Workplace_Name,Workplace_Lookup!B411)),0,1)","v":1},{"$f":"IF(C411=0,\"\",COUNTIF($B$2:C411,1))","v":410},"Emerald State School"]
[154,"Emu Creek State School",{"$f":"IF(ISERROR(SEARCH(Workplace_Name,Workplace_Lookup!B412)),0,1)","v":1},{"$f":"IF(C412=0,\"\",COUNTIF($B$2:C412,1))","v":411},"Emu Creek State School"]
[473,"Emu Park State School",{"$f":"IF(ISERROR(SEARCH(Workplace_Name,Workplace_Lookup!B413)),0,1)","v":1},{"$f":"IF(C413=0,\"\",COUNTIF($B$2:C413,1))","v":412},"Emu Park State School"]
[35,"Enoggera State School",{"$f":"IF(ISERROR(SEARCH(Workplace_Name,Workplace_Lookup!B414)),0,1)","v":1},{"$f":"IF(C414=0,\"\",COUNTIF($B$2:C414,1))","v":413},"Enoggera State School"]
[1179,"Eromanga State School",{"$f":"IF(ISERROR(SEARCH(Workplace_Name,Workplace_Lookup!B415)),0,1)","v":1},{"$f":"IF(C415=0,\"\",COUNTIF($B$2:C415,1))","v":414},"Eromanga State School"]
[199,"Esk State School",{"$f":"IF(ISERROR(SEARCH(Workplace_Name,Workplace_Lookup!B416)),0,1)","v":1},{"$f":"IF(C416=0,\"\",COUNTIF($B$2:C416,1))","v":415},"Esk State School"]
[310,"Eton State School",{"$f":"IF(ISERROR(SEARCH(Workplace_Name,Workplace_Lookup!B417)),0,1)","v":1},{"$f":"IF(C417=0,\"\",COUNTIF($B$2:C417,1))","v":416},"Eton State School"]
[682,"Eudlo State School",{"$f":"IF(ISERROR(SEARCH(Workplace_Name,Workplace_Lookup!B418)),0,1)","v":1},{"$f":"IF(C418=0,\"\",COUNTIF($B$2:C418,1))","v":417},"Eudlo State School"]
[222,"Eulo State School",{"$f":"IF(ISERROR(SEARCH(Workplace_Name,Workplace_Lookup!B419)),0,1)","v":1},{"$f":"IF(C419=0,\"\",COUNTIF($B$2:C419,1))","v":418},"Eulo State School"]
[698,"Eumundi State School",{"$f":"IF(ISERROR(SEARCH(Workplace_Name,Workplace_Lookup!B420)),0,1)","v":1},{"$f":"IF(C420=0,\"\",COUNTIF($B$2:C420,1))","v":419},"Eumundi State School"]
[1353,"Eungella State School",{"$f":"IF(ISERROR(SEARCH(Workplace_Name,Workplace_Lookup!B421)),0,1)","v":1},{"$f":"IF(C421=0,\"\",COUNTIF($B$2:C421,1))","v":420},"Eungella State School"]
["B017","Everleigh State School",{"$f":"IF(ISERROR(SEARCH(Workplace_Name,Workplace_Lookup!B422)),0,1)","v":1},{"$f":"IF(C422=0,\"\",COUNTIF($B$2:C422,1))","v":421},"Everleigh State School"]
[2061,"Everton Park State High School",{"$f":"IF(ISERROR(SEARCH(Workplace_Name,Workplace_Lookup!B423)),0,1)","v":1},{"$f":"IF(C423=0,\"\",COUNTIF($B$2:C423,1))","v":422},"Everton Park State High School"]
[1185,"Everton Park State School",{"$f":"IF(ISERROR(SEARCH(Workplace_Name,Workplace_Lookup!B424)),0,1)","v":1},{"$f":"IF(C424=0,\"\",COUNTIF($B$2:C424,1))","v":423},"Everton Park State School"]
[1751,"Fairview Heights State School",{"$f":"IF(ISERROR(SEARCH(Workplace_Name,Workplace_Lookup!B425)),0,1)","v":1},{"$f":"IF(C425=0,\"\",COUNTIF($B$2:C425,1))","v":424},"Fairview Heights State School"]
[7196,"Far North Queensland Region - Atherton Office",{"$f":"IF(ISERROR(SEARCH(Workplace_Name,Workplace_Lookup!B426)),0,1)","v":1},{"$f":"IF(C426=0,\"\",COUNTIF($B$2:C426,1))","v":425},"Far North Queensland Region - Atherton Office"]
[7197,"Far North Queensland Region - Cairns Office",{"$f":"IF(ISERROR(SEARCH(Workplace_Name,Workplace_Lookup!B427)),0,1)","v":1},{"$f":"IF(C427=0,\"\",COUNTIF($B$2:C427,1))","v":426},"Far North Queensland Region - Cairns Office"]
[1172,"Farleigh State School",{"$f":"IF(ISERROR(SEARCH(Workplace_Name,Workplace_Lookup!B428)),0,1)","v":1},{"$f":"IF(C428=0,\"\",COUNTIF($B$2:C428,1))","v":427},"Farleigh State School"]
[1027,"Farnborough State School",{"$f":"IF(ISERROR(SEARCH(Workplace_Name,Workplace_Lookup!B429)),0,1)","v":1},{"$f":"IF(C429=0,\"\",COUNTIF($B$2:C429,1))","v":428},"Farnborough State School"]
[1205,"Federal State School",{"$f":"IF(ISERROR(SEARCH(Workplace_Name,Workplace_Lookup!B430)),0,1)","v":1},{"$f":"IF(C430=0,\"\",COUNTIF($B$2:C430,1))","v":429},"Federal State School"]
[810,"Feluga State School",{"$f":"IF(ISERROR(SEARCH(Workplace_Name,Workplace_Lookup!B431)),0,1)","v":1},{"$f":"IF(C431=0,\"\",COUNTIF($B$2:C431,1))","v":430},"Feluga State School"]
[9969,"Fernbrooke State School",{"$f":"IF(ISERROR(SEARCH(Workplace_Name,Workplace_Lookup!B432)),0,1)","v":1},{"$f":"IF(C432=0,\"\",COUNTIF($B$2:C432,1))","v":431},"Fernbrooke State School"]
[170,"Fernvale State School",{"$f":"IF(ISERROR(SEARCH(Workplace_Name,Workplace_Lookup!B433)),0,1)","v":1},{"$f":"IF(C433=0,\"\",COUNTIF($B$2:C433,1))","v":432},"Fernvale State School"]
[2148,"Ferny Grove State High School",{"$f":"IF(ISERROR(SEARCH(Workplace_Name,Workplace_Lookup!B434)),0,1)","v":1},{"$f":"IF(C434=0,\"\",COUNTIF($B$2:C434,1))","v":433},"Ferny Grove State High School"]
[227,"Ferny Grove State School",{"$f":"IF(ISERROR(SEARCH(Workplace_Name,Workplace_Lookup!B435)),0,1)","v":1},{"$f":"IF(C435=0,\"\",COUNTIF($B$2:C435,1))","v":434},"Ferny Grove State School"]
[250,"Ferny Hills State School",{"$f":"IF(ISERROR(SEARCH(Workplace_Name,Workplace_Lookup!B436)),0,1)","v":1},{"$f":"IF(C436=0,\"\",COUNTIF($B$2:C436,1))","v":435},"Ferny Hills State School"]
[36,"Fig Tree Pocket State School",{"$f":"IF(ISERROR(SEARCH(Workplace_Name,Workplace_Lookup!B437)),0,1)","v":1},{"$f":"IF(C437=0,\"\",COUNTIF($B$2:C437,1))","v":436},"Fig Tree Pocket State School"]
[1175,"Finch Hatton State School",{"$f":"IF(ISERROR(SEARCH(Workplace_Name,Workplace_Lookup!B438)),0,1)","v":1},{"$f":"IF(C438=0,\"\",COUNTIF($B$2:C438,1))","v":437},"Finch Hatton State School"]
[1883,"Fitzgerald State School",{"$f":"IF(ISERROR(SEARCH(Workplace_Name,Workplace_Lookup!B439)),0,1)","v":1},{"$f":"IF(C439=0,\"\",COUNTIF($B$2:C439,1))","v":438},"Fitzgerald State School"]
[489,"Flagstone Creek State School",{"$f":"IF(ISERROR(SEARCH(Workplace_Name,Workplace_Lookup!B440)),0,1)","v":1},{"$f":"IF(C440=0,\"\",COUNTIF($B$2:C440,1))","v":439},"Flagstone Creek State School"]
[2323,"Flagstone State Community College",{"$f":"IF(ISERROR(SEARCH(Workplace_Name,Workplace_Lookup!B441)),0,1)","v":1},{"$f":"IF(C441=0,\"\",COUNTIF($B$2:C441,1))","v":440},"Flagstone State Community College"]
[471,"Flagstone State School",{"$f":"IF(ISERROR(SEARCH(Workplace_Name,Workplace_Lookup!B442)),0,1)","v":1},{"$f":"IF(C442=0,\"\",COUNTIF($B$2:C442,1))","v":441},"Flagstone State School"]
[845,"Flying Fish Point State School",{"$f":"IF(ISERROR(SEARCH(Workplace_Name,Workplace_Lookup!B443)),0,1)","v":1},{"$f":"IF(C443=0,\"\",COUNTIF($B$2:C443,1))","v":442},"Flying Fish Point State School"]
[697,"Forest Hill State School",{"$f":"IF(ISERROR(SEARCH(Workplace_Name,Workplace_Lookup!B444)),0,1)","v":1},{"$f":"IF(C444=0,\"\",COUNTIF($B$2:C444,1))","v":443},"Forest Hill State School"]
[1726,"Forest Lake State High School",{"$f":"IF(ISERROR(SEARCH(Workplace_Name,Workplace_Lookup!B445)),0,1)","v":1},{"$f":"IF(C445=0,\"\",COUNTIF($B$2:C445,1))","v":444},"Forest Lake State High School"]
[1998,"Forest Lake State School",{"$f":"IF(ISERROR(SEARCH(Workplace_Name,Workplace_Lookup!B446)),0,1)","v":1},{"$f":"IF(C446=0,\"\",COUNTIF($B$2:C446,1))","v":445},"Forest Lake State School"]
[1897,"Forrest Beach State School",{"$f":"IF(ISERROR(SEARCH(Workplace_Name,Workplace_Lookup!B447)),0,1)","v":1},{"$f":"IF(C447=0,\"\",COUNTIF($B$2:C447,1))","v":446},"Forrest Beach State School"]
[523,"Forsayth State School",{"$f":"IF(ISERROR(SEARCH(Workplace_Name,Workplace_Lookup!B448)),0,1)","v":1},{"$f":"IF(C448=0,\"\",COUNTIF($B$2:C448,1))","v":447},"Forsayth State School"]
["A722","Fortitude Valley State Secondary College",{"$f":"IF(ISERROR(SEARCH(Workplace_Name,Workplace_Lookup!B449)),0,1)","v":1},{"$f":"IF(C449=0,\"\",COUNTIF($B$2:C449,1))","v":448},"Fortitude Valley State Secondary College"]
["A788","Foxwell State Secondary College",{"$f":"IF(ISERROR(SEARCH(Workplace_Name,Workplace_Lookup!B450)),0,1)","v":1},{"$f":"IF(C450=0,\"\",COUNTIF($B$2:C450,1))","v":449},"Foxwell State Secondary College"]
[40,"Freestone State School",{"$f":"IF(ISERROR(SEARCH(Workplace_Name,Workplace_Lookup!B451)),0,1)","v":1},{"$f":"IF(C451=0,\"\",COUNTIF($B$2:C451,1))","v":450},"Freestone State School"]
[940,"Frenchville State School",{"$f":"IF(ISERROR(SEARCH(Workplace_Name,Workplace_Lookup!B452)),0,1)","v":1},{"$f":"IF(C452=0,\"\",COUNTIF($B$2:C452,1))","v":451},{"$f":"IFERROR(INDEX(B:B,MATCH(ROW(B451),D:D,0)),\"\")","v":"Frenchville State School"}]
[1812,"Freshwater State School",{"$f":"IF(ISERROR(SEARCH(Workplace_Name,Workplace_Lookup!B453)),0,1)","v":1},{"$f":"IF(C453=0,\"\",COUNTIF($B$2:C453,1))","v":452},"Freshwater State School"]
[84,"Gabbinbar State School",{"$f":"IF(ISERROR(SEARCH(Workplace_Name,Workplace_Lookup!B454)),0,1)","v":1},{"$f":"IF(C454=0,\"\",COUNTIF($B$2:C454,1))","v":453},"Gabbinbar State School"]
[9334,"Gainsborough State School",{"$f":"IF(ISERROR(SEARCH(Workplace_Name,Workplace_Lookup!B455)),0,1)","v":1},{"$f":"IF(C455=0,\"\",COUNTIF($B$2:C455,1))","v":454},"Gainsborough State School"]
[1434,"Garbutt State School",{"$f":"IF(ISERROR(SEARCH(Workplace_Name,Workplace_Lookup!B456)),0,1)","v":1},{"$f":"IF(C456=0,\"\",COUNTIF($B$2:C456,1))","v":455},"Garbutt State School"]
[1460,"Gargett State School",{"$f":"IF(ISERROR(SEARCH(Workplace_Name,Workplace_Lookup!B457)),0,1)","v":1},{"$f":"IF(C457=0,\"\",COUNTIF($B$2:C457,1))","v":456},"Gargett State School"]
[41,"Gatton State School",{"$f":"IF(ISERROR(SEARCH(Workplace_Name,Workplace_Lookup!B458)),0,1)","v":1},{"$f":"IF(C458=0,\"\",COUNTIF($B$2:C458,1))","v":457},"Gatton State School"]
[1752,"Gaven State School",{"$f":"IF(ISERROR(SEARCH(Workplace_Name,Workplace_Lookup!B459)),0,1)","v":1},{"$f":"IF(C459=0,\"\",COUNTIF($B$2:C459,1))","v":458},"Gaven State School"]
[42,"Gayndah State School",{"$f":"IF(ISERROR(SEARCH(Workplace_Name,Workplace_Lookup!B460)),0,1)","v":1},{"$f":"IF(C460=0,\"\",COUNTIF($B$2:C460,1))","v":459},"Gayndah State School"]
[3077,"Geebung Special School",{"$f":"IF(ISERROR(SEARCH(Workplace_Name,Workplace_Lookup!B461)),0,1)","v":1},{"$f":"IF(C461=0,\"\",COUNTIF($B$2:C461,1))","v":460},"Geebung Special School"]
[1257,"Geebung State School",{"$f":"IF(ISERROR(SEARCH(Workplace_Name,Workplace_Lookup!B462)),0,1)","v":1},{"$f":"IF(C462=0,\"\",COUNTIF($B$2:C462,1))","v":461},"Geebung State School"]
[54,"Geham State School",{"$f":"IF(ISERROR(SEARCH(Workplace_Name,Workplace_Lookup!B463)),0,1)","v":1},{"$f":"IF(C463=0,\"\",COUNTIF($B$2:C463,1))","v":462},"Geham State School"]
[178,"Georgetown State School",{"$f":"IF(ISERROR(SEARCH(Workplace_Name,Workplace_Lookup!B464)),0,1)","v":1},{"$f":"IF(C464=0,\"\",COUNTIF($B$2:C464,1))","v":463},"Georgetown State School"]
[50,"Gilston State School",{"$f":"IF(ISERROR(SEARCH(Workplace_Name,Workplace_Lookup!B465)),0,1)","v":1},{"$f":"IF(C465=0,\"\",COUNTIF($B$2:C465,1))","v":464},"Gilston State School"]
[2131,"Gin Gin State High School",{"$f":"IF(ISERROR(SEARCH(Workplace_Name,Workplace_Lookup!B466)),0,1)","v":1},{"$f":"IF(C466=0,\"\",COUNTIF($B$2:C466,1))","v":465},"Gin Gin State High School"]
[298,"Gin Gin State School",{"$f":"IF(ISERROR(SEARCH(Workplace_Name,Workplace_Lookup!B467)),0,1)","v":1},{"$f":"IF(C467=0,\"\",COUNTIF($B$2:C467,1))","v":466},"Gin Gin State School"]
[709,"Gindie State School",{"$f":"IF(ISERROR(SEARCH(Workplace_Name,Workplace_Lookup!B468)),0,1)","v":1},{"$f":"IF(C468=0,\"\",COUNTIF($B$2:C468,1))","v":467},"Gindie State School"]
[1258,"Giru State School",{"$f":"IF(ISERROR(SEARCH(Workplace_Name,Workplace_Lookup!B469)),0,1)","v":1},{"$f":"IF(C469=0,\"\",COUNTIF($B$2:C469,1))","v":468},"Giru State School"]
[749,"Givelda State School",{"$f":"IF(ISERROR(SEARCH(Workplace_Name,Workplace_Lookup!B470)),0,1)","v":1},{"$f":"IF(C470=0,\"\",COUNTIF($B$2:C470,1))","v":469},"Givelda State School"]
[44,"Gladstone Central State School",{"$f":"IF(ISERROR(SEARCH(Workplace_Name,Workplace_Lookup!B471)),0,1)","v":1},{"$f":"IF(C471=0,\"\",COUNTIF($B$2:C471,1))","v":470},"Gladstone Central State School"]
[825,"Gladstone South State School",{"$f":"IF(ISERROR(SEARCH(Workplace_Name,Workplace_Lookup!B472)),0,1)","v":1},{"$f":"IF(C472=0,\"\",COUNTIF($B$2:C472,1))","v":471},"Gladstone South State School"]
[2030,"Gladstone State High School",{"$f":"IF(ISERROR(SEARCH(Workplace_Name,Workplace_Lookup!B473)),0,1)","v":1},{"$f":"IF(C473=0,\"\",COUNTIF($B$2:C473,1))","v":472},"Gladstone State High School"]
[740,"Gladstone West State School",{"$f":"IF(ISERROR(SEARCH(Workplace_Name,Workplace_Lookup!B474)),0,1)","v":1},{"$f":"IF(C474=0,\"\",COUNTIF($B$2:C474,1))","v":473},"Gladstone West State School"]
[149,"Glamorgan Vale State School",{"$f":"IF(ISERROR(SEARCH(Workplace_Name,Workplace_Lookup!B475)),0,1)","v":1},{"$f":"IF(C475=0,\"\",COUNTIF($B$2:C475,1))","v":474},"Glamorgan Vale State School"]
[1242,"Glass House Mountains State School",{"$f":"IF(ISERROR(SEARCH(Workplace_Name,Workplace_Lookup!B476)),0,1)","v":1},{"$f":"IF(C476=0,\"\",COUNTIF($B$2:C476,1))","v":475},"Glass House Mountains State School"]
[544,"Glen Aplin State School",{"$f":"IF(ISERROR(SEARCH(Workplace_Name,Workplace_Lookup!B477)),0,1)","v":1},{"$f":"IF(C477=0,\"\",COUNTIF($B$2:C477,1))","v":476},"Glen Aplin State School"]
[1592,"Glenala State High School",{"$f":"IF(ISERROR(SEARCH(Workplace_Name,Workplace_Lookup!B478)),0,1)","v":1},{"$f":"IF(C478=0,\"\",COUNTIF($B$2:C478,1))","v":477},"Glenala State High School"]
[1918,"Glenden State School",{"$f":"IF(ISERROR(SEARCH(Workplace_Name,Workplace_Lookup!B479)),0,1)","v":1},{"$f":"IF(C479=0,\"\",COUNTIF($B$2:C479,1))","v":478},"Glenden State School"]
[1006,"Gleneagle State School",{"$f":"IF(ISERROR(SEARCH(Workplace_Name,Workplace_Lookup!B480)),0,1)","v":1},{"$f":"IF(C480=0,\"\",COUNTIF($B$2:C480,1))","v":479},"Gleneagle State School"]
[313,"Glenella State School",{"$f":"IF(ISERROR(SEARCH(Workplace_Name,Workplace_Lookup!B481)),0,1)","v":1},{"$f":"IF(C481=0,\"\",COUNTIF($B$2:C481,1))","v":480},"Glenella State School"]
[2028,"Glenmore State High School",{"$f":"IF(ISERROR(SEARCH(Workplace_Name,Workplace_Lookup!B482)),0,1)","v":1},{"$f":"IF(C482=0,\"\",COUNTIF($B$2:C482,1))","v":481},"Glenmore State High School"]
[574,"Glenmore State School",{"$f":"IF(ISERROR(SEARCH(Workplace_Name,Workplace_Lookup!B483)),0,1)","v":1},{"$f":"IF(C483=0,\"\",COUNTIF($B$2:C483,1))","v":482},"Glenmore State School"]
[917,"Glenmorgan State School",{"$f":"IF(ISERROR(SEARCH(Workplace_Name,Workplace_Lookup!B484)),0,1)","v":1},{"$f":"IF(C484=0,\"\",COUNTIF($B$2:C484,1))","v":483},"Glenmorgan State School"]
[770,"Glennie Heights State School",{"$f":"IF(ISERROR(SEARCH(Workplace_Name,Workplace_Lookup!B485)),0,1)","v":1},{"$f":"IF(C485=0,\"\",COUNTIF($B$2:C485,1))","v":484},"Glennie Heights State School"]
[1089,"Glenore Grove State School",{"$f":"IF(ISERROR(SEARCH(Workplace_Name,Workplace_Lookup!B486)),0,1)","v":1},{"$f":"IF(C486=0,\"\",COUNTIF($B$2:C486,1))","v":485},"Glenore Grove State School"]
[126,"Glenvale State School",{"$f":"IF(ISERROR(SEARCH(Workplace_Name,Workplace_Lookup!B487)),0,1)","v":1},{"$f":"IF(C487=0,\"\",COUNTIF($B$2:C487,1))","v":486},"Glenvale State School"]
[337,"Glenview State School",{"$f":"IF(ISERROR(SEARCH(Workplace_Name,Workplace_Lookup!B488)),0,1)","v":1},{"$f":"IF(C488=0,\"\",COUNTIF($B$2:C488,1))","v":487},"Glenview State School"]
[1617,"Glenwood State School",{"$f":"IF(ISERROR(SEARCH(Workplace_Name,Workplace_Lookup!B489)),0,1)","v":1},{"$f":"IF(C489=0,\"\",COUNTIF($B$2:C489,1))","v":488},"Glenwood State School"]
[552,"Gogango State School",{"$f":"IF(ISERROR(SEARCH(Workplace_Name,Workplace_Lookup!B490)),0,1)","v":1},{"$f":"IF(C490=0,\"\",COUNTIF($B$2:C490,1))","v":489},"Gogango State School"]
[5485,"Gold Coast International Student Centre",{"$f":"IF(ISERROR(SEARCH(Workplace_Name,Workplace_Lookup!B491)),0,1)","v":1},{"$f":"IF(C491=0,\"\",COUNTIF($B$2:C491,1))","v":490},"Gold Coast International Student Centre"]
[1920,"Golden Beach State School",{"$f":"IF(ISERROR(SEARCH(Workplace_Name,Workplace_Lookup!B492)),0,1)","v":1},{"$f":"IF(C492=0,\"\",COUNTIF($B$2:C492,1))","v":491},"Golden Beach State School"]
[407,"Gooburrum State School",{"$f":"IF(ISERROR(SEARCH(Workplace_Name,Workplace_Lookup!B493)),0,1)","v":1},{"$f":"IF(C493=0,\"\",COUNTIF($B$2:C493,1))","v":492},"Gooburrum State School"]
[3034,"Goodna Special School",{"$f":"IF(ISERROR(SEARCH(Workplace_Name,Workplace_Lookup!B494)),0,1)","v":1},{"$f":"IF(C494=0,\"\",COUNTIF($B$2:C494,1))","v":493},"Goodna Special School"]
[45,"Goodna State School",{"$f":"IF(ISERROR(SEARCH(Workplace_Name,Workplace_Lookup!B495)),0,1)","v":1},{"$f":"IF(C495=0,\"\",COUNTIF($B$2:C495,1))","v":494},"Goodna State School"]
[939,"Goodwood State School",{"$f":"IF(ISERROR(SEARCH(Workplace_Name,Workplace_Lookup!B496)),0,1)","v":1},{"$f":"IF(C496=0,\"\",COUNTIF($B$2:C496,1))","v":495},"Goodwood State School"]
[111,"Goombungee State School",{"$f":"IF(ISERROR(SEARCH(Workplace_Name,Workplace_Lookup!B497)),0,1)","v":1},{"$f":"IF(C497=0,\"\",COUNTIF($B$2:C497,1))","v":496},"Goombungee State School"]
[1310,"Goomeri State School",{"$f":"IF(ISERROR(SEARCH(Workplace_Name,Workplace_Lookup!B498)),0,1)","v":1},{"$f":"IF(C498=0,\"\",COUNTIF($B$2:C498,1))","v":497},"Goomeri State School"]
[807,"Goondi State School",{"$f":"IF(ISERROR(SEARCH(Workplace_Name,Workplace_Lookup!B499)),0,1)","v":1},{"$f":"IF(C499=0,\"\",COUNTIF($B$2:C499,1))","v":498},"Goondi State School"]
[2092,"Goondiwindi State High School",{"$f":"IF(ISERROR(SEARCH(Workplace_Name,Workplace_Lookup!B500)),0,1)","v":1},{"$f":"IF(C500=0,\"\",COUNTIF($B$2:C500,1))","v":499},"Goondiwindi State High School"]
[46,"Goondiwindi State School",{"$f":"IF(ISERROR(SEARCH(Workplace_Name,Workplace_Lookup!B501)),0,1)","v":1},{"$f":"IF(C501=0,\"\",COUNTIF($B$2:C501,1))","v":500},"Goondiwindi State School"]
[1839,"Goovigen State School",{"$f":"IF(ISERROR(SEARCH(Workplace_Name,Workplace_Lookup!B502)),0,1)","v":1},{"$f":"IF(C502=0,\"\",COUNTIF($B$2:C502,1))","v":501},"Goovigen State School"]
[2106,"Gordonvale State High School",{"$f":"IF(ISERROR(SEARCH(Workplace_Name,Workplace_Lookup!B503)),0,1)","v":1},{"$f":"IF(C503=0,\"\",COUNTIF($B$2:C503,1))","v":502},"Gordonvale State High School"]
[790,"Gordonvale State School",{"$f":"IF(ISERROR(SEARCH(Workplace_Name,Workplace_Lookup!B504)),0,1)","v":1},{"$f":"IF(C504=0,\"\",COUNTIF($B$2:C504,1))","v":503},"Gordonvale State School"]
[297,"Gowrie State School",{"$f":"IF(ISERROR(SEARCH(Workplace_Name,Workplace_Lookup!B505)),0,1)","v":1},{"$f":"IF(C505=0,\"\",COUNTIF($B$2:C505,1))","v":504},"Gowrie State School"]
[47,"Gracemere State School",{"$f":"IF(ISERROR(SEARCH(Workplace_Name,Workplace_Lookup!B506)),0,1)","v":1},{"$f":"IF(C506=0,\"\",COUNTIF($B$2:C506,1))","v":505},"Gracemere State School"]
[1515,"Graceville State School",{"$f":"IF(ISERROR(SEARCH(Workplace_Name,Workplace_Lookup!B507)),0,1)","v":1},{"$f":"IF(C507=0,\"\",COUNTIF($B$2:C507,1))","v":506},"Graceville State School"]
[1674,"Grand Avenue State School",{"$f":"IF(ISERROR(SEARCH(Workplace_Name,Workplace_Lookup!B508)),0,1)","v":1},{"$f":"IF(C508=0,\"\",COUNTIF($B$2:C508,1))","v":507},"Grand Avenue State School"]
[145,"Grandchester State School",{"$f":"IF(ISERROR(SEARCH(Workplace_Name,Workplace_Lookup!B509)),0,1)","v":1},{"$f":"IF(C509=0,\"\",COUNTIF($B$2:C509,1))","v":508},"Grandchester State School"]
[1051,"Grantham State School",{"$f":"IF(ISERROR(SEARCH(Workplace_Name,Workplace_Lookup!B510)),0,1)","v":1},{"$f":"IF(C510=0,\"\",COUNTIF($B$2:C510,1))","v":509},"Grantham State School"]
[193,"Granville State School",{"$f":"IF(ISERROR(SEARCH(Workplace_Name,Workplace_Lookup!B511)),0,1)","v":1},{"$f":"IF(C511=0,\"\",COUNTIF($B$2:C511,1))","v":510},"Granville State School"]
[695,"Greenbank State School",{"$f":"IF(ISERROR(SEARCH(Workplace_Name,Workplace_Lookup!B512)),0,1)","v":1},{"$f":"IF(C512=0,\"\",COUNTIF($B$2:C512,1))","v":511},"Greenbank State School"]
[925,"Greenlands State School",{"$f":"IF(ISERROR(SEARCH(Workplace_Name,Workplace_Lookup!B513)),0,1)","v":1},{"$f":"IF(C513=0,\"\",COUNTIF($B$2:C513,1))","v":512},"Greenlands State School"]
[976,"Greenmount State School",{"$f":"IF(ISERROR(SEARCH(Workplace_Name,Workplace_Lookup!B514)),0,1)","v":1},{"$f":"IF(C514=0,\"\",COUNTIF($B$2:C514,1))","v":513},"Greenmount State School"]
[614,"Greenslopes State School",{"$f":"IF(ISERROR(SEARCH(Workplace_Name,Workplace_Lookup!B515)),0,1)","v":1},{"$f":"IF(C515=0,\"\",COUNTIF($B$2:C515,1))","v":514},"Greenslopes State School"]
[334,"Greenvale State School",{"$f":"IF(ISERROR(SEARCH(Workplace_Name,Workplace_Lookup!B516)),0,1)","v":1},{"$f":"IF(C516=0,\"\",COUNTIF($B$2:C516,1))","v":515},{"$f":"IFERROR(INDEX(B:B,MATCH(ROW(B515),D:D,0)),\"\")","v":"Greenvale State School"}]
[9339,"Griffin State School",{"$f":"IF(ISERROR(SEARCH(Workplace_Name,Workplace_Lookup!B517)),0,1)","v":1},{"$f":"IF(C517=0,\"\",COUNTIF($B$2:C517,1))","v":516},"Griffin State School"]
[1056,"Grosmont State School",{"$f":"IF(ISERROR(SEARCH(Workplace_Name,Workplace_Lookup!B518)),0,1)","v":1},{"$f":"IF(C518=0,\"\",COUNTIF($B$2:C518,1))","v":517},"Grosmont State School"]
[1136,"Grovely State School",{"$f":"IF(ISERROR(SEARCH(Workplace_Name,Workplace_Lookup!B519)),0,1)","v":1},{"$f":"IF(C519=0,\"\",COUNTIF($B$2:C519,1))","v":518},"Grovely State School"]
[1549,"Guluguba State School",{"$f":"IF(ISERROR(SEARCH(Workplace_Name,Workplace_Lookup!B520)),0,1)","v":1},{"$f":"IF(C520=0,\"\",COUNTIF($B$2:C520,1))","v":519},"Guluguba State School"]
[1608,"Gumdale State School",{"$f":"IF(ISERROR(SEARCH(Workplace_Name,Workplace_Lookup!B521)),0,1)","v":1},{"$f":"IF(C521=0,\"\",COUNTIF($B$2:C521,1))","v":520},"Gumdale State School"]
[1391,"Gumlu State School",{"$f":"IF(ISERROR(SEARCH(Workplace_Name,Workplace_Lookup!B522)),0,1)","v":1},{"$f":"IF(C522=0,\"\",COUNTIF($B$2:C522,1))","v":521},"Gumlu State School"]
[58,"Gunalda State School",{"$f":"IF(ISERROR(SEARCH(Workplace_Name,Workplace_Lookup!B523)),0,1)","v":1},{"$f":"IF(C523=0,\"\",COUNTIF($B$2:C523,1))","v":522},"Gunalda State School"]
[821,"Gundiah State School",{"$f":"IF(ISERROR(SEARCH(Workplace_Name,Workplace_Lookup!B524)),0,1)","v":1},{"$f":"IF(C524=0,\"\",COUNTIF($B$2:C524,1))","v":523},"Gundiah State School"]
[49,"Gympie Central State School",{"$f":"IF(ISERROR(SEARCH(Workplace_Name,Workplace_Lookup!B525)),0,1)","v":1},{"$f":"IF(C525=0,\"\",COUNTIF($B$2:C525,1))","v":524},"Gympie Central State School"]
[482,"Gympie East State School",{"$f":"IF(ISERROR(SEARCH(Workplace_Name,Workplace_Lookup!B526)),0,1)","v":1},{"$f":"IF(C526=0,\"\",COUNTIF($B$2:C526,1))","v":525},"Gympie East State School"]
[9915,"Gympie Schools Trade Training Centre",{"$f":"IF(ISERROR(SEARCH(Workplace_Name,Workplace_Lookup!B527)),0,1)","v":1},{"$f":"IF(C527=0,\"\",COUNTIF($B$2:C527,1))","v":526},"Gympie Schools Trade Training Centre"]
[1221,"Gympie South State School",{"$f":"IF(ISERROR(SEARCH(Workplace_Name,Workplace_Lookup!B528)),0,1)","v":1},{"$f":"IF(C528=0,\"\",COUNTIF($B$2:C528,1))","v":527},"Gympie South State School"]
[3007,"Gympie Special School",{"$f":"IF(ISERROR(SEARCH(Workplace_Name,Workplace_Lookup!B529)),0,1)","v":1},{"$f":"IF(C529=0,\"\",COUNTIF($B$2:C529,1))","v":528},"Gympie Special School"]
[2007,"Gympie State High School",{"$f":"IF(ISERROR(SEARCH(Workplace_Name,Workplace_Lookup!B530)),0,1)","v":1},{"$f":"IF(C530=0,\"\",COUNTIF($B$2:C530,1))","v":529},"Gympie State High School"]
[560,"Gympie West State School",{"$f":"IF(ISERROR(SEARCH(Workplace_Name,Workplace_Lookup!B531)),0,1)","v":1},{"$f":"IF(C531=0,\"\",COUNTIF($B$2:C531,1))","v":530},"Gympie West State School"]
[1329,"Haden State School",{"$f":"IF(ISERROR(SEARCH(Workplace_Name,Workplace_Lookup!B532)),0,1)","v":1},{"$f":"IF(C532=0,\"\",COUNTIF($B$2:C532,1))","v":531},"Haden State School"]
[114,"Haigslea State School",{"$f":"IF(ISERROR(SEARCH(Workplace_Name,Workplace_Lookup!B533)),0,1)","v":1},{"$f":"IF(C533=0,\"\",COUNTIF($B$2:C533,1))","v":532},"Haigslea State School"]
[213,"Halifax State School",{"$f":"IF(ISERROR(SEARCH(Workplace_Name,Workplace_Lookup!B534)),0,1)","v":1},{"$f":"IF(C534=0,\"\",COUNTIF($B$2:C534,1))","v":533},"Halifax State School"]
[538,"Hambledon State School",{"$f":"IF(ISERROR(SEARCH(Workplace_Name,Workplace_Lookup!B535)),0,1)","v":1},{"$f":"IF(C535=0,\"\",COUNTIF($B$2:C535,1))","v":534},"Hambledon State School"]
[1962,"Hamilton Island State School",{"$f":"IF(ISERROR(SEARCH(Workplace_Name,Workplace_Lookup!B536)),0,1)","v":1},{"$f":"IF(C536=0,\"\",COUNTIF($B$2:C536,1))","v":535},"Hamilton Island State School"]
[1130,"Hamilton State School",{"$f":"IF(ISERROR(SEARCH(Workplace_Name,Workplace_Lookup!B537)),0,1)","v":1},{"$f":"IF(C537=0,\"\",COUNTIF($B$2:C537,1))","v":536},"Hamilton State School"]
[529,"Hampden State School",{"$f":"IF(ISERROR(SEARCH(Workplace_Name,Workplace_Lookup!B538)),0,1)","v":1},{"$f":"IF(C538=0,\"\",COUNTIF($B$2:C538,1))","v":537},"Hampden State School"]
[1849,"Hannaford State School",{"$f":"IF(ISERROR(SEARCH(Workplace_Name,Workplace_Lookup!B539)),0,1)","v":1},{"$f":"IF(C539=0,\"\",COUNTIF($B$2:C539,1))","v":538},"Hannaford State School"]
[843,"Happy Valley State School",{"$f":"IF(ISERROR(SEARCH(Workplace_Name,Workplace_Lookup!B540)),0,1)","v":1},{"$f":"IF(C540=0,\"\",COUNTIF($B$2:C540,1))","v":539},"Happy Valley State School"]
[978,"Harlaxton State School",{"$f":"IF(ISERROR(SEARCH(Workplace_Name,Workplace_Lookup!B541)),0,1)","v":1},{"$f":"IF(C541=0,\"\",COUNTIF($B$2:C541,1))","v":540},"Harlaxton State School"]
[902,"Harlin State School",{"$f":"IF(ISERROR(SEARCH(Workplace_Name,Workplace_Lookup!B542)),0,1)","v":1},{"$f":"IF(C542=0,\"\",COUNTIF($B$2:C542,1))","v":541},"Harlin State School"]
[359,"Harris Fields State School",{"$f":"IF(ISERROR(SEARCH(Workplace_Name,Workplace_Lookup!B543)),0,1)","v":1},{"$f":"IF(C543=0,\"\",COUNTIF($B$2:C543,1))","v":542},"Harris Fields State School"]
[2038,"Harristown State High School",{"$f":"IF(ISERROR(SEARCH(Workplace_Name,Workplace_Lookup!B544)),0,1)","v":1},{"$f":"IF(C544=0,\"\",COUNTIF($B$2:C544,1))","v":543},"Harristown State High School"]
[1292,"Harristown State School",{"$f":"IF(ISERROR(SEARCH(Workplace_Name,Workplace_Lookup!B545)),0,1)","v":1},{"$f":"IF(C545=0,\"\",COUNTIF($B$2:C545,1))","v":544},"Harristown State School"]
[621,"Harrisville State School",{"$f":"IF(ISERROR(SEARCH(Workplace_Name,Workplace_Lookup!B546)),0,1)","v":1},{"$f":"IF(C546=0,\"\",COUNTIF($B$2:C546,1))","v":545},"Harrisville State School"]
[390,"Hatton Vale State School",{"$f":"IF(ISERROR(SEARCH(Workplace_Name,Workplace_Lookup!B547)),0,1)","v":1},{"$f":"IF(C547=0,\"\",COUNTIF($B$2:C547,1))","v":546},"Hatton Vale State School"]
[1060,"Hayman Island State School",{"$f":"IF(ISERROR(SEARCH(Workplace_Name,Workplace_Lookup!B548)),0,1)","v":1},{"$f":"IF(C548=0,\"\",COUNTIF($B$2:C548,1))","v":547},"Hayman Island State School"]
[232,"Healy State School",{"$f":"IF(ISERROR(SEARCH(Workplace_Name,Workplace_Lookup!B549)),0,1)","v":1},{"$f":"IF(C549=0,\"\",COUNTIF($B$2:C549,1))","v":548},"Healy State School"]
[2120,"Heatley Secondary College",{"$f":"IF(ISERROR(SEARCH(Workplace_Name,Workplace_Lookup!B550)),0,1)","v":1},{"$f":"IF(C550=0,\"\",COUNTIF($B$2:C550,1))","v":549},"Heatley Secondary College"]
[305,"Heatley State School",{"$f":"IF(ISERROR(SEARCH(Workplace_Name,Workplace_Lookup!B551)),0,1)","v":1},{"$f":"IF(C551=0,\"\",COUNTIF($B$2:C551,1))","v":550},"Heatley State School"]
[954,"Hebel State School",{"$f":"IF(ISERROR(SEARCH(Workplace_Name,Workplace_Lookup!B552)),0,1)","v":1},{"$f":"IF(C552=0,\"\",COUNTIF($B$2:C552,1))","v":551},"Hebel State School"]
[2184,"Helensvale State High School",{"$f":"IF(ISERROR(SEARCH(Workplace_Name,Workplace_Lookup!B553)),0,1)","v":1},{"$f":"IF(C553=0,\"\",COUNTIF($B$2:C553,1))","v":552},"Helensvale State High School"]
[1929,"Helensvale State School",{"$f":"IF(ISERROR(SEARCH(Workplace_Name,Workplace_Lookup!B554)),0,1)","v":1},{"$f":"IF(C554=0,\"\",COUNTIF($B$2:C554,1))","v":553},"Helensvale State School"]
[52,"Helidon State School",{"$f":"IF(ISERROR(SEARCH(Workplace_Name,Workplace_Lookup!B555)),0,1)","v":1},{"$f":"IF(C555=0,\"\",COUNTIF($B$2:C555,1))","v":554},"Helidon State School"]
[33,"Hendra State School",{"$f":"IF(ISERROR(SEARCH(Workplace_Name,Workplace_Lookup!B556)),0,1)","v":1},{"$f":"IF(C556=0,\"\",COUNTIF($B$2:C556,1))","v":555},"Hendra State School"]
[254,"Herberton State School",{"$f":"IF(ISERROR(SEARCH(Workplace_Name,Workplace_Lookup!B557)),0,1)","v":1},{"$f":"IF(C557=0,\"\",COUNTIF($B$2:C557,1))","v":556},"Herberton State School"]
[6140,"Herberton State School - Primary Campus",{"$f":"IF(ISERROR(SEARCH(Workplace_Name,Workplace_Lookup!B558)),0,1)","v":1},{"$f":"IF(C558=0,\"\",COUNTIF($B$2:C558,1))","v":557},"Herberton State School - Primary Campus"]
[6141,"Herberton State School - Secondary Campus",{"$f":"IF(ISERROR(SEARCH(Workplace_Name,Workplace_Lookup!B559)),0,1)","v":1},{"$f":"IF(C559=0,\"\",COUNTIF($B$2:C559,1))","v":558},"Herberton State School - Secondary Campus"]
[1858,"Hercules Road State School",{"$f":"IF(ISERROR(SEARCH(Workplace_Name,Workplace_Lookup!B560)),0,1)","v":1},{"$f":"IF(C560=0,\"\",COUNTIF($B$2:C560,1))","v":559},"Hercules Road State School"]
[873,"Hermit Park State School",{"$f":"IF(ISERROR(SEARCH(Workplace_Name,Workplace_Lookup!B561)),0,1)","v":1},{"$f":"IF(C561=0,\"\",COUNTIF($B$2:C561,1))","v":560},"Hermit Park State School"]
[3057,"Hervey Bay Special School",{"$f":"IF(ISERROR(SEARCH(Workplace_Name,Workplace_Lookup!B562)),0,1)","v":1},{"$f":"IF(C562=0,\"\",COUNTIF($B$2:C562,1))","v":561},"Hervey Bay Special School"]
[2093,"Hervey Bay State High School",{"$f":"IF(ISERROR(SEARCH(Workplace_Name,Workplace_Lookup!B563)),0,1)","v":1},{"$f":"IF(C563=0,\"\",COUNTIF($B$2:C563,1))","v":562},"Hervey Bay State High School"]
[53,"Highfields State School",{"$f":"IF(ISERROR(SEARCH(Workplace_Name,Workplace_Lookup!B564)),0,1)","v":1},{"$f":"IF(C564=0,\"\",COUNTIF($B$2:C564,1))","v":563},"Highfields State School"]
[9340,"Highfields State Secondary College",{"$f":"IF(ISERROR(SEARCH(Workplace_Name,Workplace_Lookup!B565)),0,1)","v":1},{"$f":"IF(C565=0,\"\",COUNTIF($B$2:C565,1))","v":564},"Highfields State Secondary College"]
[6135,"Highland Reserve State School",{"$f":"IF(ISERROR(SEARCH(Workplace_Name,Workplace_Lookup!B566)),0,1)","v":1},{"$f":"IF(C566=0,\"\",COUNTIF($B$2:C566,1))","v":565},"Highland Reserve State School"]
[1887,"Hilder Road State School",{"$f":"IF(ISERROR(SEARCH(Workplace_Name,Workplace_Lookup!B567)),0,1)","v":1},{"$f":"IF(C567=0,\"\",COUNTIF($B$2:C567,1))","v":566},"Hilder Road State School"]
[1986,"Hilliard State School",{"$f":"IF(ISERROR(SEARCH(Workplace_Name,Workplace_Lookup!B568)),0,1)","v":1},{"$f":"IF(C568=0,\"\",COUNTIF($B$2:C568,1))","v":567},"Hilliard State School"]
[541,"Hillview State School",{"$f":"IF(ISERROR(SEARCH(Workplace_Name,Workplace_Lookup!B569)),0,1)","v":1},{"$f":"IF(C569=0,\"\",COUNTIF($B$2:C569,1))","v":568},"Hillview State School"]
[2125,"Holland Park State High School",{"$f":"IF(ISERROR(SEARCH(Workplace_Name,Workplace_Lookup!B570)),0,1)","v":1},{"$f":"IF(C570=0,\"\",COUNTIF($B$2:C570,1))","v":569},"Holland Park State High School"]
[1593,"Holland Park State School",{"$f":"IF(ISERROR(SEARCH(Workplace_Name,Workplace_Lookup!B571)),0,1)","v":1},{"$f":"IF(C571=0,\"\",COUNTIF($B$2:C571,1))","v":570},"Holland Park State School"]
[3582,"Holloways Beach Environmental Education Centre",{"$f":"IF(ISERROR(SEARCH(Workplace_Name,Workplace_Lookup!B572)),0,1)","v":1},{"$f":"IF(C572=0,\"\",COUNTIF($B$2:C572,1))","v":571},"Holloways Beach Environmental Education Centre"]
[2094,"Home Hill State High School",{"$f":"IF(ISERROR(SEARCH(Workplace_Name,Workplace_Lookup!B573)),0,1)","v":1},{"$f":"IF(C573=0,\"\",COUNTIF($B$2:C573,1))","v":572},"Home Hill State High School"]
[1380,"Home Hill State School",{"$f":"IF(ISERROR(SEARCH(Workplace_Name,Workplace_Lookup!B574)),0,1)","v":1},{"$f":"IF(C574=0,\"\",COUNTIF($B$2:C574,1))","v":573},"Home Hill State School"]
[470,"Homebush State School",{"$f":"IF(ISERROR(SEARCH(Workplace_Name,Workplace_Lookup!B575)),0,1)","v":1},{"$f":"IF(C575=0,\"\",COUNTIF($B$2:C575,1))","v":574},"Homebush State School"]
[241,"Homestead State School",{"$f":"IF(ISERROR(SEARCH(Workplace_Name,Workplace_Lookup!B576)),0,1)","v":1},{"$f":"IF(C576=0,\"\",COUNTIF($B$2:C576,1))","v":575},"Homestead State School"]
[243,"Hopevale Campus of CYAAA",{"$f":"IF(ISERROR(SEARCH(Workplace_Name,Workplace_Lookup!B577)),0,1)","v":1},{"$f":"IF(C577=0,\"\",COUNTIF($B$2:C577,1))","v":576},"Hopevale Campus of CYAAA"]
[345,"Howard State School",{"$f":"IF(ISERROR(SEARCH(Workplace_Name,Workplace_Lookup!B578)),0,1)","v":1},{"$f":"IF(C578=0,\"\",COUNTIF($B$2:C578,1))","v":577},"Howard State School"]
[388,"Hughenden State School",{"$f":"IF(ISERROR(SEARCH(Workplace_Name,Workplace_Lookup!B579)),0,1)","v":1},{"$f":"IF(C579=0,\"\",COUNTIF($B$2:C579,1))","v":578},"Hughenden State School"]
[164,"Humpybong State School",{"$f":"IF(ISERROR(SEARCH(Workplace_Name,Workplace_Lookup!B580)),0,1)","v":1},{"$f":"IF(C580=0,\"\",COUNTIF($B$2:C580,1))","v":579},{"$f":"IFERROR(INDEX(B:B,MATCH(ROW(B579),D:D,0)),\"\")","v":"Humpybong State School"}]
[713,"Ilfracombe State School",{"$f":"IF(ISERROR(SEARCH(Workplace_Name,Workplace_Lookup!B581)),0,1)","v":1},{"$f":"IF(C581=0,\"\",COUNTIF($B$2:C581,1))","v":580},"Ilfracombe State School"]
[1116,"Inala State School",{"$f":"IF(ISERROR(SEARCH(Workplace_Name,Workplace_Lookup!B582)),0,1)","v":1},{"$f":"IF(C582=0,\"\",COUNTIF($B$2:C582,1))","v":581},"Inala State School"]
[2034,"Indooroopilly State High School",{"$f":"IF(ISERROR(SEARCH(Workplace_Name,Workplace_Lookup!B583)),0,1)","v":1},{"$f":"IF(C583=0,\"\",COUNTIF($B$2:C583,1))","v":582},"Indooroopilly State High School"]
[585,"Indooroopilly State School",{"$f":"IF(ISERROR(SEARCH(Workplace_Name,Workplace_Lookup!B584)),0,1)","v":1},{"$f":"IF(C584=0,\"\",COUNTIF($B$2:C584,1))","v":583},"Indooroopilly State School"]
[2027,"Ingham State High School",{"$f":"IF(ISERROR(SEARCH(Workplace_Name,Workplace_Lookup!B585)),0,1)","v":1},{"$f":"IF(C585=0,\"\",COUNTIF($B$2:C585,1))","v":584},"Ingham State High School"]
[450,"Ingham State School",{"$f":"IF(ISERROR(SEARCH(Workplace_Name,Workplace_Lookup!B586)),0,1)","v":1},{"$f":"IF(C586=0,\"\",COUNTIF($B$2:C586,1))","v":585},"Ingham State School"]
[661,"Ingleside State School",{"$f":"IF(ISERROR(SEARCH(Workplace_Name,Workplace_Lookup!B587)),0,1)","v":1},{"$f":"IF(C587=0,\"\",COUNTIF($B$2:C587,1))","v":586},"Ingleside State School"]
[55,"Inglewood State School",{"$f":"IF(ISERROR(SEARCH(Workplace_Name,Workplace_Lookup!B588)),0,1)","v":1},{"$f":"IF(C588=0,\"\",COUNTIF($B$2:C588,1))","v":587},"Inglewood State School"]
[1723,"Injune P-10 State School",{"$f":"IF(ISERROR(SEARCH(Workplace_Name,Workplace_Lookup!B589)),0,1)","v":1},{"$f":"IF(C589=0,\"\",COUNTIF($B$2:C589,1))","v":588},"Injune P-10 State School"]
[1660,"Innisfail East State School",{"$f":"IF(ISERROR(SEARCH(Workplace_Name,Workplace_Lookup!B590)),0,1)","v":1},{"$f":"IF(C590=0,\"\",COUNTIF($B$2:C590,1))","v":589},"Innisfail East State School"]
[6463,"Innisfail State College",{"$f":"IF(ISERROR(SEARCH(Workplace_Name,Workplace_Lookup!B591)),0,1)","v":1},{"$f":"IF(C591=0,\"\",COUNTIF($B$2:C591,1))","v":590},"Innisfail State College"]
[527,"Innisfail State School",{"$f":"IF(ISERROR(SEARCH(Workplace_Name,Workplace_Lookup!B592)),0,1)","v":1},{"$f":"IF(C592=0,\"\",COUNTIF($B$2:C592,1))","v":591},"Innisfail State School"]
[59,"Ipswich Central State School",{"$f":"IF(ISERROR(SEARCH(Workplace_Name,Workplace_Lookup!B593)),0,1)","v":1},{"$f":"IF(C593=0,\"\",COUNTIF($B$2:C593,1))","v":592},"Ipswich Central State School"]
[575,"Ipswich East State School",{"$f":"IF(ISERROR(SEARCH(Workplace_Name,Workplace_Lookup!B594)),0,1)","v":1},{"$f":"IF(C594=0,\"\",COUNTIF($B$2:C594,1))","v":593},"Ipswich East State School"]
[61,"Ipswich North State School",{"$f":"IF(ISERROR(SEARCH(Workplace_Name,Workplace_Lookup!B595)),0,1)","v":1},{"$f":"IF(C595=0,\"\",COUNTIF($B$2:C595,1))","v":594},"Ipswich North State School"]
[3018,"Ipswich Special School",{"$f":"IF(ISERROR(SEARCH(Workplace_Name,Workplace_Lookup!B596)),0,1)","v":1},{"$f":"IF(C596=0,\"\",COUNTIF($B$2:C596,1))","v":595},"Ipswich Special School"]
[2069,"Ipswich State High School",{"$f":"IF(ISERROR(SEARCH(Workplace_Name,Workplace_Lookup!B597)),0,1)","v":1},{"$f":"IF(C597=0,\"\",COUNTIF($B$2:C597,1))","v":596},"Ipswich State High School"]
[3015,"Ipswich West Special School",{"$f":"IF(ISERROR(SEARCH(Workplace_Name,Workplace_Lookup!B598)),0,1)","v":1},{"$f":"IF(C598=0,\"\",COUNTIF($B$2:C598,1))","v":597},"Ipswich West Special School"]
[366,"Ipswich West State School",{"$f":"IF(ISERROR(SEARCH(Workplace_Name,Workplace_Lookup!B599)),0,1)","v":1},{"$f":"IF(C599=0,\"\",COUNTIF($B$2:C599,1))","v":598},"Ipswich West State School"]
[108,"Ironside State School",{"$f":"IF(ISERROR(SEARCH(Workplace_Name,Workplace_Lookup!B600)),0,1)","v":1},{"$f":"IF(C600=0,\"\",COUNTIF($B$2:C600,1))","v":599},"Ironside State School"]
[519,"Irvinebank State School",{"$f":"IF(ISERROR(SEARCH(Workplace_Name,Workplace_Lookup!B601)),0,1)","v":1},{"$f":"IF(C601=0,\"\",COUNTIF($B$2:C601,1))","v":600},"Irvinebank State School"]
[1721,"Isabella State School",{"$f":"IF(ISERROR(SEARCH(Workplace_Name,Workplace_Lookup!B602)),0,1)","v":1},{"$f":"IF(C602=0,\"\",COUNTIF($B$2:C602,1))","v":601},"Isabella State School"]
[2063,"Isis District State High School",{"$f":"IF(ISERROR(SEARCH(Workplace_Name,Workplace_Lookup!B603)),0,1)","v":1},{"$f":"IF(C603=0,\"\",COUNTIF($B$2:C603,1))","v":602},"Isis District State High School"]
[63,"Isisford State School",{"$f":"IF(ISERROR(SEARCH(Workplace_Name,Workplace_Lookup!B604)),0,1)","v":1},{"$f":"IF(C604=0,\"\",COUNTIF($B$2:C604,1))","v":603},"Isisford State School"]
[455,"Ithaca Creek State School",{"$f":"IF(ISERROR(SEARCH(Workplace_Name,Workplace_Lookup!B605)),0,1)","v":1},{"$f":"IF(C605=0,\"\",COUNTIF($B$2:C605,1))","v":604},"Ithaca Creek State School"]
[3552,"Jacobs Well Environmental Education Centre",{"$f":"IF(ISERROR(SEARCH(Workplace_Name,Workplace_Lookup!B606)),0,1)","v":1},{"$f":"IF(C606=0,\"\",COUNTIF($B$2:C606,1))","v":605},"Jacobs Well Environmental Education Centre"]
[1659,"Jambin State School",{"$f":"IF(ISERROR(SEARCH(Workplace_Name,Workplace_Lookup!B607)),0,1)","v":1},{"$f":"IF(C607=0,\"\",COUNTIF($B$2:C607,1))","v":606},"Jambin State School"]
[276,"Jamboree Heights State School",{"$f":"IF(ISERROR(SEARCH(Workplace_Name,Workplace_Lookup!B608)),0,1)","v":1},{"$f":"IF(C608=0,\"\",COUNTIF($B$2:C608,1))","v":607},"Jamboree Heights State School"]
[2137,"James Nash State High School",{"$f":"IF(ISERROR(SEARCH(Workplace_Name,Workplace_Lookup!B609)),0,1)","v":1},{"$f":"IF(C609=0,\"\",COUNTIF($B$2:C609,1))","v":608},"James Nash State High School"]
[537,"Jandowae Prep-10 State School",{"$f":"IF(ISERROR(SEARCH(Workplace_Name,Workplace_Lookup!B610)),0,1)","v":1},{"$f":"IF(C610=0,\"\",COUNTIF($B$2:C610,1))","v":609},"Jandowae Prep-10 State School"]
[798,"Jarvisfield State School",{"$f":"IF(ISERROR(SEARCH(Workplace_Name,Workplace_Lookup!B611)),0,1)","v":1},{"$f":"IF(C611=0,\"\",COUNTIF($B$2:C611,1))","v":610},"Jarvisfield State School"]
[206,"Jericho State School",{"$f":"IF(ISERROR(SEARCH(Workplace_Name,Workplace_Lookup!B612)),0,1)","v":1},{"$f":"IF(C612=0,\"\",COUNTIF($B$2:C612,1))","v":611},"Jericho State School"]
[604,"Jimboomba State School",{"$f":"IF(ISERROR(SEARCH(Workplace_Name,Workplace_Lookup!B613)),0,1)","v":1},{"$f":"IF(C613=0,\"\",COUNTIF($B$2:C613,1))","v":612},"Jimboomba State School"]
[1558,"Jimbour State School",{"$f":"IF(ISERROR(SEARCH(Workplace_Name,Workplace_Lookup!B614)),0,1)","v":1},{"$f":"IF(C614=0,\"\",COUNTIF($B$2:C614,1))","v":613},"Jimbour State School"]
[402,"Jindalee State School",{"$f":"IF(ISERROR(SEARCH(Workplace_Name,Workplace_Lookup!B615)),0,1)","v":1},{"$f":"IF(C615=0,\"\",COUNTIF($B$2:C615,1))","v":614},"Jindalee State School"]
[180,"Jinibara State School",{"$f":"IF(ISERROR(SEARCH(Workplace_Name,Workplace_Lookup!B616)),0,1)","v":1},{"$f":"IF(C616=0,\"\",COUNTIF($B$2:C616,1))","v":615},"Jinibara State School"]
[64,"Jondaryan State School",{"$f":"IF(ISERROR(SEARCH(Workplace_Name,Workplace_Lookup!B617)),0,1)","v":1},{"$f":"IF(C617=0,\"\",COUNTIF($B$2:C617,1))","v":616},"Jondaryan State School"]
[649,"Jones Hill State School",{"$f":"IF(ISERROR(SEARCH(Workplace_Name,Workplace_Lookup!B618)),0,1)","v":1},{"$f":"IF(C618=0,\"\",COUNTIF($B$2:C618,1))","v":617},"Jones Hill State School"]
[1809,"Julatten State School",{"$f":"IF(ISERROR(SEARCH(Workplace_Name,Workplace_Lookup!B619)),0,1)","v":1},{"$f":"IF(C619=0,\"\",COUNTIF($B$2:C619,1))","v":618},"Julatten State School"]
[1289,"Julia Creek State School",{"$f":"IF(ISERROR(SEARCH(Workplace_Name,Workplace_Lookup!B620)),0,1)","v":1},{"$f":"IF(C620=0,\"\",COUNTIF($B$2:C620,1))","v":619},"Julia Creek State School"]
[514,"Junction Park State School",{"$f":"IF(ISERROR(SEARCH(Workplace_Name,Workplace_Lookup!B621)),0,1)","v":1},{"$f":"IF(C621=0,\"\",COUNTIF($B$2:C621,1))","v":620},"Junction Park State School"]
[910,"Jundah State School",{"$f":"IF(ISERROR(SEARCH(Workplace_Name,Workplace_Lookup!B622)),0,1)","v":1},{"$f":"IF(C622=0,\"\",COUNTIF($B$2:C622,1))","v":621},"Jundah State School"]
[1187,"Kaimkillenbun State School",{"$f":"IF(ISERROR(SEARCH(Workplace_Name,Workplace_Lookup!B623)),0,1)","v":1},{"$f":"IF(C623=0,\"\",COUNTIF($B$2:C623,1))","v":622},"Kaimkillenbun State School"]
[1279,"Kairi State School",{"$f":"IF(ISERROR(SEARCH(Workplace_Name,Workplace_Lookup!B624)),0,1)","v":1},{"$f":"IF(C624=0,\"\",COUNTIF($B$2:C624,1))","v":623},"Kairi State School"]
[1494,"Kalamia State School",{"$f":"IF(ISERROR(SEARCH(Workplace_Name,Workplace_Lookup!B625)),0,1)","v":1},{"$f":"IF(C625=0,\"\",COUNTIF($B$2:C625,1))","v":624},"Kalamia State School"]
[343,"Kalbar State School",{"$f":"IF(ISERROR(SEARCH(Workplace_Name,Workplace_Lookup!B626)),0,1)","v":1},{"$f":"IF(C626=0,\"\",COUNTIF($B$2:C626,1))","v":625},"Kalbar State School"]
[277,"Kalkie State School",{"$f":"IF(ISERROR(SEARCH(Workplace_Name,Workplace_Lookup!B627)),0,1)","v":1},{"$f":"IF(C627=0,\"\",COUNTIF($B$2:C627,1))","v":626},"Kalkie State School"]
[605,"Kallangur State School",{"$f":"IF(ISERROR(SEARCH(Workplace_Name,Workplace_Lookup!B628)),0,1)","v":1},{"$f":"IF(C628=0,\"\",COUNTIF($B$2:C628,1))","v":627},"Kallangur State School"]
[1478,"Kandanga State School",{"$f":"IF(ISERROR(SEARCH(Workplace_Name,Workplace_Lookup!B629)),0,1)","v":1},{"$f":"IF(C629=0,\"\",COUNTIF($B$2:C629,1))","v":628},"Kandanga State School"]
[1938,"Karalee State School",{"$f":"IF(ISERROR(SEARCH(Workplace_Name,Workplace_Lookup!B630)),0,1)","v":1},{"$f":"IF(C630=0,\"\",COUNTIF($B$2:C630,1))","v":629},"Karalee State School"]
[1145,"Karara State School",{"$f":"IF(ISERROR(SEARCH(Workplace_Name,Workplace_Lookup!B631)),0,1)","v":1},{"$f":"IF(C631=0,\"\",COUNTIF($B$2:C631,1))","v":630},"Karara State School"]
[449,"Karumba State School",{"$f":"IF(ISERROR(SEARCH(Workplace_Name,Workplace_Lookup!B632)),0,1)","v":1},{"$f":"IF(C632=0,\"\",COUNTIF($B$2:C632,1))","v":631},"Karumba State School"]
[5653,"Kawana Waters State College",{"$f":"IF(ISERROR(SEARCH(Workplace_Name,Workplace_Lookup!B633)),0,1)","v":1},{"$f":"IF(C633=0,\"\",COUNTIF($B$2:C633,1))","v":632},"Kawana Waters State College"]
[1987,"Kawungan State School",{"$f":"IF(ISERROR(SEARCH(Workplace_Name,Workplace_Lookup!B634)),0,1)","v":1},{"$f":"IF(C634=0,\"\",COUNTIF($B$2:C634,1))","v":633},"Kawungan State School"]
[2039,"Kedron State High School",{"$f":"IF(ISERROR(SEARCH(Workplace_Name,Workplace_Lookup!B635)),0,1)","v":1},{"$f":"IF(C635=0,\"\",COUNTIF($B$2:C635,1))","v":634},"Kedron State High School"]
[371,"Kedron State School",{"$f":"IF(ISERROR(SEARCH(Workplace_Name,Workplace_Lookup!B636)),0,1)","v":1},{"$f":"IF(C636=0,\"\",COUNTIF($B$2:C636,1))","v":635},"Kedron State School"]
[2046,"Keebra Park State High School",{"$f":"IF(ISERROR(SEARCH(Workplace_Name,Workplace_Lookup!B637)),0,1)","v":1},{"$f":"IF(C637=0,\"\",COUNTIF($B$2:C637,1))","v":636},"Keebra Park State High School"]
[1960,"Kelso State School",{"$f":"IF(ISERROR(SEARCH(Workplace_Name,Workplace_Lookup!B638)),0,1)","v":1},{"$f":"IF(C638=0,\"\",COUNTIF($B$2:C638,1))","v":637},"Kelso State School"]
[2409,"Kelvin Grove State College",{"$f":"IF(ISERROR(SEARCH(Workplace_Name,Workplace_Lookup!B639)),0,1)","v":1},{"$f":"IF(C639=0,\"\",COUNTIF($B$2:C639,1))","v":638},"Kelvin Grove State College"]
[1309,"Kenilworth State Community College",{"$f":"IF(ISERROR(SEARCH(Workplace_Name,Workplace_Lookup!B640)),0,1)","v":1},{"$f":"IF(C640=0,\"\",COUNTIF($B$2:C640,1))","v":639},"Kenilworth State Community College"]
[1143,"Kenmore South State School",{"$f":"IF(ISERROR(SEARCH(Workplace_Name,Workplace_Lookup!B641)),0,1)","v":1},{"$f":"IF(C641=0,\"\",COUNTIF($B$2:C641,1))","v":640},"Kenmore South State School"]
[2132,"Kenmore State High School",{"$f":"IF(ISERROR(SEARCH(Workplace_Name,Workplace_Lookup!B642)),0,1)","v":1},{"$f":"IF(C642=0,\"\",COUNTIF($B$2:C642,1))","v":641},"Kenmore State High School"]
[923,"Kenmore State School",{"$f":"IF(ISERROR(SEARCH(Workplace_Name,Workplace_Lookup!B643)),0,1)","v":1},{"$f":"IF(C643=0,\"\",COUNTIF($B$2:C643,1))","v":642},"Kenmore State School"]
[868,"Kennedy State School",{"$f":"IF(ISERROR(SEARCH(Workplace_Name,Workplace_Lookup!B644)),0,1)","v":1},{"$f":"IF(C644=0,\"\",COUNTIF($B$2:C644,1))","v":643},{"$f":"IFERROR(INDEX(B:B,MATCH(ROW(B643),D:D,0)),\"\")","v":"Kennedy State School"}]
[710,"Kentville State School",{"$f":"IF(ISERROR(SEARCH(Workplace_Name,Workplace_Lookup!B645)),0,1)","v":1},{"$f":"IF(C645=0,\"\",COUNTIF($B$2:C645,1))","v":644},"Kentville State School"]
[2095,"Kepnock State High School",{"$f":"IF(ISERROR(SEARCH(Workplace_Name,Workplace_Lookup!B646)),0,1)","v":1},{"$f":"IF(C646=0,\"\",COUNTIF($B$2:C646,1))","v":645},"Kepnock State High School"]
[670,"Keppel Sands State School",{"$f":"IF(ISERROR(SEARCH(Workplace_Name,Workplace_Lookup!B647)),0,1)","v":1},{"$f":"IF(C647=0,\"\",COUNTIF($B$2:C647,1))","v":646},"Keppel Sands State School"]
[1707,"Kia-Ora State School",{"$f":"IF(ISERROR(SEARCH(Workplace_Name,Workplace_Lookup!B648)),0,1)","v":1},{"$f":"IF(C648=0,\"\",COUNTIF($B$2:C648,1))","v":647},"Kia-Ora State School"]
[2133,"Kilcoy State High School",{"$f":"IF(ISERROR(SEARCH(Workplace_Name,Workplace_Lookup!B649)),0,1)","v":1},{"$f":"IF(C649=0,\"\",COUNTIF($B$2:C649,1))","v":648},"Kilcoy State High School"]
[679,"Kilcoy State School",{"$f":"IF(ISERROR(SEARCH(Workplace_Name,Workplace_Lookup!B650)),0,1)","v":1},{"$f":"IF(C650=0,\"\",COUNTIF($B$2:C650,1))","v":649},"Kilcoy State School"]
[787,"Kilcummin State School",{"$f":"IF(ISERROR(SEARCH(Workplace_Name,Workplace_Lookup!B651)),0,1)","v":1},{"$f":"IF(C651=0,\"\",COUNTIF($B$2:C651,1))","v":650},"Kilcummin State School"]
[168,"Kilkivan State School",{"$f":"IF(ISERROR(SEARCH(Workplace_Name,Workplace_Lookup!B652)),0,1)","v":1},{"$f":"IF(C652=0,\"\",COUNTIF($B$2:C652,1))","v":651},"Kilkivan State School"]
[163,"Killarney P-10 State School",{"$f":"IF(ISERROR(SEARCH(Workplace_Name,Workplace_Lookup!B653)),0,1)","v":1},{"$f":"IF(C653=0,\"\",COUNTIF($B$2:C653,1))","v":652},"Killarney P-10 State School"]
[1937,"Kimberley Park State School",{"$f":"IF(ISERROR(SEARCH(Workplace_Name,Workplace_Lookup!B654)),0,1)","v":1},{"$f":"IF(C654=0,\"\",COUNTIF($B$2:C654,1))","v":653},"Kimberley Park State School"]
[1534,"Kin Kin State School",{"$f":"IF(ISERROR(SEARCH(Workplace_Name,Workplace_Lookup!B655)),0,1)","v":1},{"$f":"IF(C655=0,\"\",COUNTIF($B$2:C655,1))","v":654},"Kin Kin State School"]
[1912,"Kin Kora State School",{"$f":"IF(ISERROR(SEARCH(Workplace_Name,Workplace_Lookup!B656)),0,1)","v":1},{"$f":"IF(C656=0,\"\",COUNTIF($B$2:C656,1))","v":655},"Kin Kora State School"]
[3579,"Kinchant Dam Outdoor Education Centre",{"$f":"IF(ISERROR(SEARCH(Workplace_Name,Workplace_Lookup!B657)),0,1)","v":1},{"$f":"IF(C657=0,\"\",COUNTIF($B$2:C657,1))","v":656},"Kinchant Dam Outdoor Education Centre"]
[753,"Kindon State School",{"$f":"IF(ISERROR(SEARCH(Workplace_Name,Workplace_Lookup!B658)),0,1)","v":1},{"$f":"IF(C658=0,\"\",COUNTIF($B$2:C658,1))","v":657},"Kindon State School"]
[2044,"Kingaroy State High School",{"$f":"IF(ISERROR(SEARCH(Workplace_Name,Workplace_Lookup!B659)),0,1)","v":1},{"$f":"IF(C659=0,\"\",COUNTIF($B$2:C659,1))","v":658},"Kingaroy State High School"]
[995,"Kingaroy State School",{"$f":"IF(ISERROR(SEARCH(Workplace_Name,Workplace_Lookup!B660)),0,1)","v":1},{"$f":"IF(C660=0,\"\",COUNTIF($B$2:C660,1))","v":659},"Kingaroy State School"]
[1274,"Kingsthorpe State School",{"$f":"IF(ISERROR(SEARCH(Workplace_Name,Workplace_Lookup!B661)),0,1)","v":1},{"$f":"IF(C661=0,\"\",COUNTIF($B$2:C661,1))","v":660},"Kingsthorpe State School"]
[2139,"Kingston State College",{"$f":"IF(ISERROR(SEARCH(Workplace_Name,Workplace_Lookup!B662)),0,1)","v":1},{"$f":"IF(C662=0,\"\",COUNTIF($B$2:C662,1))","v":661},"Kingston State College"]
[1348,"Kingston State School",{"$f":"IF(ISERROR(SEARCH(Workplace_Name,Workplace_Lookup!B663)),0,1)","v":1},{"$f":"IF(C663=0,\"\",COUNTIF($B$2:C663,1))","v":662},"Kingston State School"]
[415,"Kioma State School",{"$f":"IF(ISERROR(SEARCH(Workplace_Name,Workplace_Lookup!B664)),0,1)","v":1},{"$f":"IF(C664=0,\"\",COUNTIF($B$2:C664,1))","v":663},"Kioma State School"]
[616,"Kippa-Ring State School",{"$f":"IF(ISERROR(SEARCH(Workplace_Name,Workplace_Lookup!B665)),0,1)","v":1},{"$f":"IF(C665=0,\"\",COUNTIF($B$2:C665,1))","v":664},"Kippa-Ring State School"]
[2146,"Kirwan State High School",{"$f":"IF(ISERROR(SEARCH(Workplace_Name,Workplace_Lookup!B666)),0,1)","v":1},{"$f":"IF(C666=0,\"\",COUNTIF($B$2:C666,1))","v":665},"Kirwan State High School"]
[1862,"Kirwan State School",{"$f":"IF(ISERROR(SEARCH(Workplace_Name,Workplace_Lookup!B667)),0,1)","v":1},{"$f":"IF(C667=0,\"\",COUNTIF($B$2:C667,1))","v":666},"Kirwan State School"]
[1078,"Kogan State School",{"$f":"IF(ISERROR(SEARCH(Workplace_Name,Workplace_Lookup!B668)),0,1)","v":1},{"$f":"IF(C668=0,\"\",COUNTIF($B$2:C668,1))","v":667},"Kogan State School"]
[279,"Kolan South State School",{"$f":"IF(ISERROR(SEARCH(Workplace_Name,Workplace_Lookup!B669)),0,1)","v":1},{"$f":"IF(C669=0,\"\",COUNTIF($B$2:C669,1))","v":668},"Kolan South State School"]
[3571,"Konomie Island Environmental Education Centre",{"$f":"IF(ISERROR(SEARCH(Workplace_Name,Workplace_Lookup!B670)),0,1)","v":1},{"$f":"IF(C670=0,\"\",COUNTIF($B$2:C670,1))","v":669},"Konomie Island Environmental Education Centre"]
[1780,"Koumala State School",{"$f":"IF(ISERROR(SEARCH(Workplace_Name,Workplace_Lookup!B671)),0,1)","v":1},{"$f":"IF(C671=0,\"\",COUNTIF($B$2:C671,1))","v":670},"Koumala State School"]
[460,"Kowanyama State School",{"$f":"IF(ISERROR(SEARCH(Workplace_Name,Workplace_Lookup!B672)),0,1)","v":1},{"$f":"IF(C672=0,\"\",COUNTIF($B$2:C672,1))","v":671},"Kowanyama State School"]
[1878,"Kruger State School",{"$f":"IF(ISERROR(SEARCH(Workplace_Name,Workplace_Lookup!B673)),0,1)","v":1},{"$f":"IF(C673=0,\"\",COUNTIF($B$2:C673,1))","v":672},"Kruger State School"]
[1472,"Kulpi State School",{"$f":"IF(ISERROR(SEARCH(Workplace_Name,Workplace_Lookup!B674)),0,1)","v":1},{"$f":"IF(C674=0,\"\",COUNTIF($B$2:C674,1))","v":673},"Kulpi State School"]
[1968,"Kuluin State School",{"$f":"IF(ISERROR(SEARCH(Workplace_Name,Workplace_Lookup!B675)),0,1)","v":1},{"$f":"IF(C675=0,\"\",COUNTIF($B$2:C675,1))","v":674},"Kuluin State School"]
[1423,"Kumbia State School",{"$f":"IF(ISERROR(SEARCH(Workplace_Name,Workplace_Lookup!B676)),0,1)","v":1},{"$f":"IF(C676=0,\"\",COUNTIF($B$2:C676,1))","v":675},"Kumbia State School"]
[3040,"Kuraby Special School",{"$f":"IF(ISERROR(SEARCH(Workplace_Name,Workplace_Lookup!B677)),0,1)","v":1},{"$f":"IF(C677=0,\"\",COUNTIF($B$2:C677,1))","v":676},"Kuraby Special School"]
[1462,"Kuraby State School",{"$f":"IF(ISERROR(SEARCH(Workplace_Name,Workplace_Lookup!B678)),0,1)","v":1},{"$f":"IF(C678=0,\"\",COUNTIF($B$2:C678,1))","v":677},"Kuraby State School"]
[5689,"Kuranda District State College",{"$f":"IF(ISERROR(SEARCH(Workplace_Name,Workplace_Lookup!B679)),0,1)","v":1},{"$f":"IF(C679=0,\"\",COUNTIF($B$2:C679,1))","v":678},"Kuranda District State College"]
[1958,"Kurwongbah State School",{"$f":"IF(ISERROR(SEARCH(Workplace_Name,Workplace_Lookup!B680)),0,1)","v":1},{"$f":"IF(C680=0,\"\",COUNTIF($B$2:C680,1))","v":679},"Kurwongbah State School"]
[443,"Labrador State School",{"$f":"IF(ISERROR(SEARCH(Workplace_Name,Workplace_Lookup!B681)),0,1)","v":1},{"$f":"IF(C681=0,\"\",COUNTIF($B$2:C681,1))","v":680},"Labrador State School"]
[1676,"Laidley District State School",{"$f":"IF(ISERROR(SEARCH(Workplace_Name,Workplace_Lookup!B682)),0,1)","v":1},{"$f":"IF(C682=0,\"\",COUNTIF($B$2:C682,1))","v":681},"Laidley District State School"]
[2163,"Laidley State High School",{"$f":"IF(ISERROR(SEARCH(Workplace_Name,Workplace_Lookup!B683)),0,1)","v":1},{"$f":"IF(C683=0,\"\",COUNTIF($B$2:C683,1))","v":682},"Laidley State High School"]
[1009,"Lake Clarendon State School",{"$f":"IF(ISERROR(SEARCH(Workplace_Name,Workplace_Lookup!B684)),0,1)","v":1},{"$f":"IF(C684=0,\"\",COUNTIF($B$2:C684,1))","v":683},"Lake Clarendon State School"]
[202,"Lakeland State School",{"$f":"IF(ISERROR(SEARCH(Workplace_Name,Workplace_Lookup!B685)),0,1)","v":1},{"$f":"IF(C685=0,\"\",COUNTIF($B$2:C685,1))","v":684},"Lakeland State School"]
[67,"Lakes Creek State School",{"$f":"IF(ISERROR(SEARCH(Workplace_Name,Workplace_Lookup!B686)),0,1)","v":1},{"$f":"IF(C686=0,\"\",COUNTIF($B$2:C686,1))","v":685},"Lakes Creek State School"]
[349,"Landsborough State School",{"$f":"IF(ISERROR(SEARCH(Workplace_Name,Workplace_Lookup!B687)),0,1)","v":1},{"$f":"IF(C687=0,\"\",COUNTIF($B$2:C687,1))","v":686},"Landsborough State School"]
[583,"Laura State School",{"$f":"IF(ISERROR(SEARCH(Workplace_Name,Workplace_Lookup!B688)),0,1)","v":1},{"$f":"IF(C688=0,\"\",COUNTIF($B$2:C688,1))","v":687},"Laura State School"]
[329,"Lawnton State School",{"$f":"IF(ISERROR(SEARCH(Workplace_Name,Workplace_Lookup!B689)),0,1)","v":1},{"$f":"IF(C689=0,\"\",COUNTIF($B$2:C689,1))","v":688},"Lawnton State School"]
["A791","Lee Street State Special School",{"$f":"IF(ISERROR(SEARCH(Workplace_Name,Workplace_Lookup!B690)),0,1)","v":1},{"$f":"IF(C690=0,\"\",COUNTIF($B$2:C690,1))","v":689},"Lee Street State Special School"]
[1148,"Leichhardt State School",{"$f":"IF(ISERROR(SEARCH(Workplace_Name,Workplace_Lookup!B691)),0,1)","v":1},{"$f":"IF(C691=0,\"\",COUNTIF($B$2:C691,1))","v":690},"Leichhardt State School"]
[68,"Leyburn State School",{"$f":"IF(ISERROR(SEARCH(Workplace_Name,Workplace_Lookup!B692)),0,1)","v":1},{"$f":"IF(C692=0,\"\",COUNTIF($B$2:C692,1))","v":691},"Leyburn State School"]
[980,"Linville State School",{"$f":"IF(ISERROR(SEARCH(Workplace_Name,Workplace_Lookup!B693)),0,1)","v":1},{"$f":"IF(C693=0,\"\",COUNTIF($B$2:C693,1))","v":692},"Linville State School"]
[1119,"Lochington State School",{"$f":"IF(ISERROR(SEARCH(Workplace_Name,Workplace_Lookup!B694)),0,1)","v":1},{"$f":"IF(C694=0,\"\",COUNTIF($B$2:C694,1))","v":693},"Lochington State School"]
[505,"Lockhart State School",{"$f":"IF(ISERROR(SEARCH(Workplace_Name,Workplace_Lookup!B695)),0,1)","v":1},{"$f":"IF(C695=0,\"\",COUNTIF($B$2:C695,1))","v":694},"Lockhart State School"]
[1061,"Lockrose State School",{"$f":"IF(ISERROR(SEARCH(Workplace_Name,Workplace_Lookup!B696)),0,1)","v":1},{"$f":"IF(C696=0,\"\",COUNTIF($B$2:C696,1))","v":695},"Lockrose State School"]
[2062,"Lockyer District State High School",{"$f":"IF(ISERROR(SEARCH(Workplace_Name,Workplace_Lookup!B697)),0,1)","v":1},{"$f":"IF(C697=0,\"\",COUNTIF($B$2:C697,1))","v":696},"Lockyer District State High School"]
[3001,"Logan City Special School",{"$f":"IF(ISERROR(SEARCH(Workplace_Name,Workplace_Lookup!B698)),0,1)","v":1},{"$f":"IF(C698=0,\"\",COUNTIF($B$2:C698,1))","v":697},"Logan City Special School"]
[69,"Logan Reserve State School",{"$f":"IF(ISERROR(SEARCH(Workplace_Name,Workplace_Lookup!B699)),0,1)","v":1},{"$f":"IF(C699=0,\"\",COUNTIF($B$2:C699,1))","v":698},"Logan Reserve State School"]
[123,"Logan Village State School",{"$f":"IF(ISERROR(SEARCH(Workplace_Name,Workplace_Lookup!B700)),0,1)","v":1},{"$f":"IF(C700=0,\"\",COUNTIF($B$2:C700,1))","v":699},"Logan Village State School"]
[70,"Loganholme State School",{"$f":"IF(ISERROR(SEARCH(Workplace_Name,Workplace_Lookup!B701)),0,1)","v":1},{"$f":"IF(C701=0,\"\",COUNTIF($B$2:C701,1))","v":700},"Loganholme State School"]
[2153,"Loganlea State High School",{"$f":"IF(ISERROR(SEARCH(Workplace_Name,Workplace_Lookup!B702)),0,1)","v":1},{"$f":"IF(C702=0,\"\",COUNTIF($B$2:C702,1))","v":701},"Loganlea State High School"]
[3611,"Longreach School of Distance Education",{"$f":"IF(ISERROR(SEARCH(Workplace_Name,Workplace_Lookup!B703)),0,1)","v":1},{"$f":"IF(C703=0,\"\",COUNTIF($B$2:C703,1))","v":702},"Longreach School of Distance Education"]
[2112,"Longreach State High School",{"$f":"IF(ISERROR(SEARCH(Workplace_Name,Workplace_Lookup!B704)),0,1)","v":1},{"$f":"IF(C704=0,\"\",COUNTIF($B$2:C704,1))","v":703},"Longreach State High School"]
[711,"Longreach State School",{"$f":"IF(ISERROR(SEARCH(Workplace_Name,Workplace_Lookup!B705)),0,1)","v":1},{"$f":"IF(C705=0,\"\",COUNTIF($B$2:C705,1))","v":704},"Longreach State School"]
[882,"Lota State School",{"$f":"IF(ISERROR(SEARCH(Workplace_Name,Workplace_Lookup!B706)),0,1)","v":1},{"$f":"IF(C706=0,\"\",COUNTIF($B$2:C706,1))","v":705},"Lota State School"]
[1010,"Lower Tully State School",{"$f":"IF(ISERROR(SEARCH(Workplace_Name,Workplace_Lookup!B707)),0,1)","v":1},{"$f":"IF(C707=0,\"\",COUNTIF($B$2:C707,1))","v":706},"Lower Tully State School"]
[1140,"Lowmead State School",{"$f":"IF(ISERROR(SEARCH(Workplace_Name,Workplace_Lookup!B708)),0,1)","v":1},{"$f":"IF(C708=0,\"\",COUNTIF($B$2:C708,1))","v":707},{"$f":"IFERROR(INDEX(B:B,MATCH(ROW(B707),D:D,0)),\"\")","v":"Lowmead State School"}]
[2160,"Lowood State High School",{"$f":"IF(ISERROR(SEARCH(Workplace_Name,Workplace_Lookup!B709)),0,1)","v":1},{"$f":"IF(C709=0,\"\",COUNTIF($B$2:C709,1))","v":708},"Lowood State High School"]
[242,"Lowood State School",{"$f":"IF(ISERROR(SEARCH(Workplace_Name,Workplace_Lookup!B710)),0,1)","v":1},{"$f":"IF(C710=0,\"\",COUNTIF($B$2:C710,1))","v":709},"Lowood State School"]
[418,"Lundavra State School",{"$f":"IF(ISERROR(SEARCH(Workplace_Name,Workplace_Lookup!B711)),0,1)","v":1},{"$f":"IF(C711=0,\"\",COUNTIF($B$2:C711,1))","v":710},"Lundavra State School"]
[383,"Ma Ma Creek State School",{"$f":"IF(ISERROR(SEARCH(Workplace_Name,Workplace_Lookup!B712)),0,1)","v":1},{"$f":"IF(C712=0,\"\",COUNTIF($B$2:C712,1))","v":711},"Ma Ma Creek State School"]
[2161,"Mabel Park State High School",{"$f":"IF(ISERROR(SEARCH(Workplace_Name,Workplace_Lookup!B713)),0,1)","v":1},{"$f":"IF(C713=0,\"\",COUNTIF($B$2:C713,1))","v":712},"Mabel Park State High School"]
[356,"Mabel Park State School",{"$f":"IF(ISERROR(SEARCH(Workplace_Name,Workplace_Lookup!B714)),0,1)","v":1},{"$f":"IF(C714=0,\"\",COUNTIF($B$2:C714,1))","v":713},"Mabel Park State School"]
[2124,"MacGregor State High School",{"$f":"IF(ISERROR(SEARCH(Workplace_Name,Workplace_Lookup!B715)),0,1)","v":1},{"$f":"IF(C715=0,\"\",COUNTIF($B$2:C715,1))","v":714},"MacGregor State High School"]
[192,"MacGregor State School",{"$f":"IF(ISERROR(SEARCH(Workplace_Name,Workplace_Lookup!B716)),0,1)","v":1},{"$f":"IF(C716=0,\"\",COUNTIF($B$2:C716,1))","v":715},"MacGregor State School"]
[758,"Machans Beach State School",{"$f":"IF(ISERROR(SEARCH(Workplace_Name,Workplace_Lookup!B717)),0,1)","v":1},{"$f":"IF(C717=0,\"\",COUNTIF($B$2:C717,1))","v":716},"Machans Beach State School"]
[71,"Mackay Central State School",{"$f":"IF(ISERROR(SEARCH(Workplace_Name,Workplace_Lookup!B718)),0,1)","v":1},{"$f":"IF(C718=0,\"\",COUNTIF($B$2:C718,1))","v":717},"Mackay Central State School"]
[3082,"Mackay District Special School",{"$f":"IF(ISERROR(SEARCH(Workplace_Name,Workplace_Lookup!B719)),0,1)","v":1},{"$f":"IF(C719=0,\"\",COUNTIF($B$2:C719,1))","v":718},"Mackay District Special School"]
[2096,"Mackay North State High School",{"$f":"IF(ISERROR(SEARCH(Workplace_Name,Workplace_Lookup!B720)),0,1)","v":1},{"$f":"IF(C720=0,\"\",COUNTIF($B$2:C720,1))","v":719},"Mackay North State High School"]
[746,"Mackay North State School",{"$f":"IF(ISERROR(SEARCH(Workplace_Name,Workplace_Lookup!B721)),0,1)","v":1},{"$f":"IF(C721=0,\"\",COUNTIF($B$2:C721,1))","v":720},"Mackay North State School"]
[7873,"Mackay Northern Beaches State High School",{"$f":"IF(ISERROR(SEARCH(Workplace_Name,Workplace_Lookup!B722)),0,1)","v":1},{"$f":"IF(C722=0,\"\",COUNTIF($B$2:C722,1))","v":721},"Mackay Northern Beaches State High School"]
[2009,"Mackay State High School",{"$f":"IF(ISERROR(SEARCH(Workplace_Name,Workplace_Lookup!B723)),0,1)","v":1},{"$f":"IF(C723=0,\"\",COUNTIF($B$2:C723,1))","v":722},"Mackay State High School"]
[501,"Mackay West State School",{"$f":"IF(ISERROR(SEARCH(Workplace_Name,Workplace_Lookup!B724)),0,1)","v":1},{"$f":"IF(C724=0,\"\",COUNTIF($B$2:C724,1))","v":723},"Mackay West State School"]
[608,"Mackenzie State Primary School",{"$f":"IF(ISERROR(SEARCH(Workplace_Name,Workplace_Lookup!B725)),0,1)","v":1},{"$f":"IF(C725=0,\"\",COUNTIF($B$2:C725,1))","v":724},"Mackenzie State Primary School"]
[3012,"Mackenzie State Special School",{"$f":"IF(ISERROR(SEARCH(Workplace_Name,Workplace_Lookup!B726)),0,1)","v":1},{"$f":"IF(C726=0,\"\",COUNTIF($B$2:C726,1))","v":725},"Mackenzie State Special School"]
[324,"Macknade State School",{"$f":"IF(ISERROR(SEARCH(Workplace_Name,Workplace_Lookup!B727)),0,1)","v":1},{"$f":"IF(C727=0,\"\",COUNTIF($B$2:C727,1))","v":726},"Macknade State School"]
[1959,"MacLeay Island State School",{"$f":"IF(ISERROR(SEARCH(Workplace_Name,Workplace_Lookup!B728)),0,1)","v":1},{"$f":"IF(C728=0,\"\",COUNTIF($B$2:C728,1))","v":727},"MacLeay Island State School"]
[1219,"Magnetic Island State School",{"$f":"IF(ISERROR(SEARCH(Workplace_Name,Workplace_Lookup!B729)),0,1)","v":1},{"$f":"IF(C729=0,\"\",COUNTIF($B$2:C729,1))","v":728},"Magnetic Island State School"]
[1214,"Maidavale State School",{"$f":"IF(ISERROR(SEARCH(Workplace_Name,Workplace_Lookup!B730)),0,1)","v":1},{"$f":"IF(C730=0,\"\",COUNTIF($B$2:C730,1))","v":729},"Maidavale State School"]
[2067,"Malanda State High School",{"$f":"IF(ISERROR(SEARCH(Workplace_Name,Workplace_Lookup!B731)),0,1)","v":1},{"$f":"IF(C731=0,\"\",COUNTIF($B$2:C731,1))","v":730},"Malanda State High School"]
[1396,"Malanda State School",{"$f":"IF(ISERROR(SEARCH(Workplace_Name,Workplace_Lookup!B732)),0,1)","v":1},{"$f":"IF(C732=0,\"\",COUNTIF($B$2:C732,1))","v":731},"Malanda State School"]
[2177,"Maleny State High School",{"$f":"IF(ISERROR(SEARCH(Workplace_Name,Workplace_Lookup!B733)),0,1)","v":1},{"$f":"IF(C733=0,\"\",COUNTIF($B$2:C733,1))","v":732},"Maleny State High School"]
[1390,"Maleny State School",{"$f":"IF(ISERROR(SEARCH(Workplace_Name,Workplace_Lookup!B734)),0,1)","v":1},{"$f":"IF(C734=0,\"\",COUNTIF($B$2:C734,1))","v":733},"Maleny State School"]
[7575,"Mango Hill State School",{"$f":"IF(ISERROR(SEARCH(Workplace_Name,Workplace_Lookup!B735)),0,1)","v":1},{"$f":"IF(C735=0,\"\",COUNTIF($B$2:C735,1))","v":734},"Mango Hill State School"]
["A787","Mango Hill State Secondary College",{"$f":"IF(ISERROR(SEARCH(Workplace_Name,Workplace_Lookup!B736)),0,1)","v":1},{"$f":"IF(C736=0,\"\",COUNTIF($B$2:C736,1))","v":735},"Mango Hill State Secondary College"]
[1222,"Manly State School",{"$f":"IF(ISERROR(SEARCH(Workplace_Name,Workplace_Lookup!B737)),0,1)","v":1},{"$f":"IF(C737=0,\"\",COUNTIF($B$2:C737,1))","v":736},"Manly State School"]
[264,"Manly West State School",{"$f":"IF(ISERROR(SEARCH(Workplace_Name,Workplace_Lookup!B738)),0,1)","v":1},{"$f":"IF(C738=0,\"\",COUNTIF($B$2:C738,1))","v":737},"Manly West State School"]
[2059,"Mansfield State High School",{"$f":"IF(ISERROR(SEARCH(Workplace_Name,Workplace_Lookup!B739)),0,1)","v":1},{"$f":"IF(C739=0,\"\",COUNTIF($B$2:C739,1))","v":738},"Mansfield State High School"]
[143,"Mansfield State School",{"$f":"IF(ISERROR(SEARCH(Workplace_Name,Workplace_Lookup!B740)),0,1)","v":1},{"$f":"IF(C740=0,\"\",COUNTIF($B$2:C740,1))","v":739},"Mansfield State School"]
[878,"Mapleton State School",{"$f":"IF(ISERROR(SEARCH(Workplace_Name,Workplace_Lookup!B741)),0,1)","v":1},{"$f":"IF(C741=0,\"\",COUNTIF($B$2:C741,1))","v":740},"Mapleton State School"]
[320,"Marburg State School",{"$f":"IF(ISERROR(SEARCH(Workplace_Name,Workplace_Lookup!B742)),0,1)","v":1},{"$f":"IF(C742=0,\"\",COUNTIF($B$2:C742,1))","v":741},"Marburg State School"]
[2058,"Mareeba State High School",{"$f":"IF(ISERROR(SEARCH(Workplace_Name,Workplace_Lookup!B743)),0,1)","v":1},{"$f":"IF(C743=0,\"\",COUNTIF($B$2:C743,1))","v":742},"Mareeba State High School"]
[653,"Mareeba State School",{"$f":"IF(ISERROR(SEARCH(Workplace_Name,Workplace_Lookup!B744)),0,1)","v":1},{"$f":"IF(C744=0,\"\",COUNTIF($B$2:C744,1))","v":743},"Mareeba State School"]
[518,"Marian State School",{"$f":"IF(ISERROR(SEARCH(Workplace_Name,Workplace_Lookup!B745)),0,1)","v":1},{"$f":"IF(C745=0,\"\",COUNTIF($B$2:C745,1))","v":744},"Marian State School"]
[1584,"Marlborough State School",{"$f":"IF(ISERROR(SEARCH(Workplace_Name,Workplace_Lookup!B746)),0,1)","v":1},{"$f":"IF(C746=0,\"\",COUNTIF($B$2:C746,1))","v":745},"Marlborough State School"]
[1122,"Marmor State School",{"$f":"IF(ISERROR(SEARCH(Workplace_Name,Workplace_Lookup!B747)),0,1)","v":1},{"$f":"IF(C747=0,\"\",COUNTIF($B$2:C747,1))","v":746},"Marmor State School"]
[2097,"Maroochydore State High School",{"$f":"IF(ISERROR(SEARCH(Workplace_Name,Workplace_Lookup!B748)),0,1)","v":1},{"$f":"IF(C748=0,\"\",COUNTIF($B$2:C748,1))","v":747},"Maroochydore State High School"]
[1711,"Maroochydore State School",{"$f":"IF(ISERROR(SEARCH(Workplace_Name,Workplace_Lookup!B749)),0,1)","v":1},{"$f":"IF(C749=0,\"\",COUNTIF($B$2:C749,1))","v":748},"Maroochydore State School"]
[3550,"Maroon Outdoor Education Centre",{"$f":"IF(ISERROR(SEARCH(Workplace_Name,Workplace_Lookup!B750)),0,1)","v":1},{"$f":"IF(C750=0,\"\",COUNTIF($B$2:C750,1))","v":749},"Maroon Outdoor Education Centre"]
[640,"Maroon State School",{"$f":"IF(ISERROR(SEARCH(Workplace_Name,Workplace_Lookup!B751)),0,1)","v":1},{"$f":"IF(C751=0,\"\",COUNTIF($B$2:C751,1))","v":750},"Maroon State School"]
[1251,"Maroondan State School",{"$f":"IF(ISERROR(SEARCH(Workplace_Name,Workplace_Lookup!B752)),0,1)","v":1},{"$f":"IF(C752=0,\"\",COUNTIF($B$2:C752,1))","v":751},"Maroondan State School"]
[2176,"Marsden State High School",{"$f":"IF(ISERROR(SEARCH(Workplace_Name,Workplace_Lookup!B753)),0,1)","v":1},{"$f":"IF(C753=0,\"\",COUNTIF($B$2:C753,1))","v":752},"Marsden State High School"]
[1875,"Marsden State School",{"$f":"IF(ISERROR(SEARCH(Workplace_Name,Workplace_Lookup!B754)),0,1)","v":1},{"$f":"IF(C754=0,\"\",COUNTIF($B$2:C754,1))","v":753},"Marsden State School"]
[708,"Marshall Road State School",{"$f":"IF(ISERROR(SEARCH(Workplace_Name,Workplace_Lookup!B755)),0,1)","v":1},{"$f":"IF(C755=0,\"\",COUNTIF($B$2:C755,1))","v":754},"Marshall Road State School"]
[465,"Mary Valley State College",{"$f":"IF(ISERROR(SEARCH(Workplace_Name,Workplace_Lookup!B756)),0,1)","v":1},{"$f":"IF(C756=0,\"\",COUNTIF($B$2:C756,1))","v":755},"Mary Valley State College"]
[72,"Maryborough Central State School",{"$f":"IF(ISERROR(SEARCH(Workplace_Name,Workplace_Lookup!B757)),0,1)","v":1},{"$f":"IF(C757=0,\"\",COUNTIF($B$2:C757,1))","v":756},"Maryborough Central State School"]
[3017,"Maryborough Special School",{"$f":"IF(ISERROR(SEARCH(Workplace_Name,Workplace_Lookup!B758)),0,1)","v":1},{"$f":"IF(C758=0,\"\",COUNTIF($B$2:C758,1))","v":757},"Maryborough Special School"]
[2020,"Maryborough State High School",{"$f":"IF(ISERROR(SEARCH(Workplace_Name,Workplace_Lookup!B759)),0,1)","v":1},{"$f":"IF(C759=0,\"\",COUNTIF($B$2:C759,1))","v":758},"Maryborough State High School"]
[485,"Maryborough West State School",{"$f":"IF(ISERROR(SEARCH(Workplace_Name,Workplace_Lookup!B760)),0,1)","v":1},{"$f":"IF(C760=0,\"\",COUNTIF($B$2:C760,1))","v":759},"Maryborough West State School"]
[1389,"Maryvale State School",{"$f":"IF(ISERROR(SEARCH(Workplace_Name,Workplace_Lookup!B761)),0,1)","v":1},{"$f":"IF(C761=0,\"\",COUNTIF($B$2:C761,1))","v":760},"Maryvale State School"]
[1090,"Mayfield State School",{"$f":"IF(ISERROR(SEARCH(Workplace_Name,Workplace_Lookup!B762)),0,1)","v":1},{"$f":"IF(C762=0,\"\",COUNTIF($B$2:C762,1))","v":761},"Mayfield State School"]
[1400,"McDonnell Creek State School",{"$f":"IF(ISERROR(SEARCH(Workplace_Name,Workplace_Lookup!B763)),0,1)","v":1},{"$f":"IF(C763=0,\"\",COUNTIF($B$2:C763,1))","v":762},"McDonnell Creek State School"]
[378,"McDowall State School",{"$f":"IF(ISERROR(SEARCH(Workplace_Name,Workplace_Lookup!B764)),0,1)","v":1},{"$f":"IF(C764=0,\"\",COUNTIF($B$2:C764,1))","v":763},"McDowall State School"]
[1394,"McIlwraith State School",{"$f":"IF(ISERROR(SEARCH(Workplace_Name,Workplace_Lookup!B765)),0,1)","v":1},{"$f":"IF(C765=0,\"\",COUNTIF($B$2:C765,1))","v":764},"McIlwraith State School"]
[1473,"Meandarra State School",{"$f":"IF(ISERROR(SEARCH(Workplace_Name,Workplace_Lookup!B766)),0,1)","v":1},{"$f":"IF(C766=0,\"\",COUNTIF($B$2:C766,1))","v":765},"Meandarra State School"]
[1673,"Mena Creek State School",{"$f":"IF(ISERROR(SEARCH(Workplace_Name,Workplace_Lookup!B767)),0,1)","v":1},{"$f":"IF(C767=0,\"\",COUNTIF($B$2:C767,1))","v":766},"Mena Creek State School"]
[1733,"Meridan State College",{"$f":"IF(ISERROR(SEARCH(Workplace_Name,Workplace_Lookup!B768)),0,1)","v":1},{"$f":"IF(C768=0,\"\",COUNTIF($B$2:C768,1))","v":767},"Meridan State College"]
[806,"Merinda State School",{"$f":"IF(ISERROR(SEARCH(Workplace_Name,Workplace_Lookup!B769)),0,1)","v":1},{"$f":"IF(C769=0,\"\",COUNTIF($B$2:C769,1))","v":768},"Merinda State School"]
[179,"Meringandan State School",{"$f":"IF(ISERROR(SEARCH(Workplace_Name,Workplace_Lookup!B770)),0,1)","v":1},{"$f":"IF(C770=0,\"\",COUNTIF($B$2:C770,1))","v":769},"Meringandan State School"]
[2147,"Merrimac State High School",{"$f":"IF(ISERROR(SEARCH(Workplace_Name,Workplace_Lookup!B771)),0,1)","v":1},{"$f":"IF(C771=0,\"\",COUNTIF($B$2:C771,1))","v":770},"Merrimac State High School"]
[1586,"Merrimac State School",{"$f":"IF(ISERROR(SEARCH(Workplace_Name,Workplace_Lookup!B772)),0,1)","v":1},{"$f":"IF(C772=0,\"\",COUNTIF($B$2:C772,1))","v":771},{"$f":"IFERROR(INDEX(B:B,MATCH(ROW(B771),D:D,0)),\"\")","v":"Merrimac State School"}]
[9615,"Metro North Region - Nundah Office",{"$f":"IF(ISERROR(SEARCH(Workplace_Name,Workplace_Lookup!B773)),0,1)","v":1},{"$f":"IF(C773=0,\"\",COUNTIF($B$2:C773,1))","v":772},"Metro North Region - Nundah Office"]
[7208,"Metro South Region - Ipswich Office",{"$f":"IF(ISERROR(SEARCH(Workplace_Name,Workplace_Lookup!B774)),0,1)","v":1},{"$f":"IF(C774=0,\"\",COUNTIF($B$2:C774,1))","v":773},"Metro South Region - Ipswich Office"]
[7215,"Metro South Region - Mt Gravatt Office",{"$f":"IF(ISERROR(SEARCH(Workplace_Name,Workplace_Lookup!B775)),0,1)","v":1},{"$f":"IF(C775=0,\"\",COUNTIF($B$2:C775,1))","v":774},"Metro South Region - Mt Gravatt Office"]
[1291,"Miallo State School",{"$f":"IF(ISERROR(SEARCH(Workplace_Name,Workplace_Lookup!B776)),0,1)","v":1},{"$f":"IF(C776=0,\"\",COUNTIF($B$2:C776,1))","v":775},"Miallo State School"]
[2086,"Miami State High School",{"$f":"IF(ISERROR(SEARCH(Workplace_Name,Workplace_Lookup!B777)),0,1)","v":1},{"$f":"IF(C777=0,\"\",COUNTIF($B$2:C777,1))","v":776},"Miami State High School"]
[1890,"Miami State School",{"$f":"IF(ISERROR(SEARCH(Workplace_Name,Workplace_Lookup!B778)),0,1)","v":1},{"$f":"IF(C778=0,\"\",COUNTIF($B$2:C778,1))","v":777},"Miami State School"]
[1969,"Middle Park State School",{"$f":"IF(ISERROR(SEARCH(Workplace_Name,Workplace_Lookup!B779)),0,1)","v":1},{"$f":"IF(C779=0,\"\",COUNTIF($B$2:C779,1))","v":778},"Middle Park State School"]
[414,"Middle Ridge State School",{"$f":"IF(ISERROR(SEARCH(Workplace_Name,Workplace_Lookup!B780)),0,1)","v":1},{"$f":"IF(C780=0,\"\",COUNTIF($B$2:C780,1))","v":779},"Middle Ridge State School"]
[1905,"Middlemount Community School",{"$f":"IF(ISERROR(SEARCH(Workplace_Name,Workplace_Lookup!B781)),0,1)","v":1},{"$f":"IF(C781=0,\"\",COUNTIF($B$2:C781,1))","v":780},"Middlemount Community School"]
[2144,"Miles State High School",{"$f":"IF(ISERROR(SEARCH(Workplace_Name,Workplace_Lookup!B782)),0,1)","v":1},{"$f":"IF(C782=0,\"\",COUNTIF($B$2:C782,1))","v":781},"Miles State High School"]
[341,"Miles State School",{"$f":"IF(ISERROR(SEARCH(Workplace_Name,Workplace_Lookup!B783)),0,1)","v":1},{"$f":"IF(C783=0,\"\",COUNTIF($B$2:C783,1))","v":782},"Miles State School"]
[771,"Millaa Millaa State School",{"$f":"IF(ISERROR(SEARCH(Workplace_Name,Workplace_Lookup!B784)),0,1)","v":1},{"$f":"IF(C784=0,\"\",COUNTIF($B$2:C784,1))","v":783},"Millaa Millaa State School"]
[867,"Millaroo State School",{"$f":"IF(ISERROR(SEARCH(Workplace_Name,Workplace_Lookup!B785)),0,1)","v":1},{"$f":"IF(C785=0,\"\",COUNTIF($B$2:C785,1))","v":784},"Millaroo State School"]
[157,"Millchester State School",{"$f":"IF(ISERROR(SEARCH(Workplace_Name,Workplace_Lookup!B786)),0,1)","v":1},{"$f":"IF(C786=0,\"\",COUNTIF($B$2:C786,1))","v":785},"Millchester State School"]
[176,"Millmerran State School",{"$f":"IF(ISERROR(SEARCH(Workplace_Name,Workplace_Lookup!B787)),0,1)","v":1},{"$f":"IF(C787=0,\"\",COUNTIF($B$2:C787,1))","v":786},"Millmerran State School"]
[1120,"Milman State School",{"$f":"IF(ISERROR(SEARCH(Workplace_Name,Workplace_Lookup!B788)),0,1)","v":1},{"$f":"IF(C788=0,\"\",COUNTIF($B$2:C788,1))","v":787},"Milman State School"]
[2024,"Milpera State High School",{"$f":"IF(ISERROR(SEARCH(Workplace_Name,Workplace_Lookup!B789)),0,1)","v":1},{"$f":"IF(C789=0,\"\",COUNTIF($B$2:C789,1))","v":788},"Milpera State High School"]
[551,"Milton State School",{"$f":"IF(ISERROR(SEARCH(Workplace_Name,Workplace_Lookup!B790)),0,1)","v":1},{"$f":"IF(C790=0,\"\",COUNTIF($B$2:C790,1))","v":789},"Milton State School"]
[294,"Minden State School",{"$f":"IF(ISERROR(SEARCH(Workplace_Name,Workplace_Lookup!B791)),0,1)","v":1},{"$f":"IF(C791=0,\"\",COUNTIF($B$2:C791,1))","v":790},"Minden State School"]
[265,"Minimbah State School",{"$f":"IF(ISERROR(SEARCH(Workplace_Name,Workplace_Lookup!B792)),0,1)","v":1},{"$f":"IF(C792=0,\"\",COUNTIF($B$2:C792,1))","v":791},"Minimbah State School"]
[2117,"Mirani State High School",{"$f":"IF(ISERROR(SEARCH(Workplace_Name,Workplace_Lookup!B793)),0,1)","v":1},{"$f":"IF(C793=0,\"\",COUNTIF($B$2:C793,1))","v":792},"Mirani State High School"]
[658,"Mirani State School",{"$f":"IF(ISERROR(SEARCH(Workplace_Name,Workplace_Lookup!B794)),0,1)","v":1},{"$f":"IF(C794=0,\"\",COUNTIF($B$2:C794,1))","v":793},"Mirani State School"]
[792,"Miriam Vale State School",{"$f":"IF(ISERROR(SEARCH(Workplace_Name,Workplace_Lookup!B795)),0,1)","v":1},{"$f":"IF(C795=0,\"\",COUNTIF($B$2:C795,1))","v":794},"Miriam Vale State School"]
[1382,"Mirriwinni State School",{"$f":"IF(ISERROR(SEARCH(Workplace_Name,Workplace_Lookup!B796)),0,1)","v":1},{"$f":"IF(C796=0,\"\",COUNTIF($B$2:C796,1))","v":795},"Mirriwinni State School"]
[1324,"Mission Beach State School",{"$f":"IF(ISERROR(SEARCH(Workplace_Name,Workplace_Lookup!B797)),0,1)","v":1},{"$f":"IF(C797=0,\"\",COUNTIF($B$2:C797,1))","v":796},"Mission Beach State School"]
[1919,"Mistake Creek State School",{"$f":"IF(ISERROR(SEARCH(Workplace_Name,Workplace_Lookup!B798)),0,1)","v":1},{"$f":"IF(C798=0,\"\",COUNTIF($B$2:C798,1))","v":797},"Mistake Creek State School"]
[27,"Mitchell State School",{"$f":"IF(ISERROR(SEARCH(Workplace_Name,Workplace_Lookup!B799)),0,1)","v":1},{"$f":"IF(C799=0,\"\",COUNTIF($B$2:C799,1))","v":798},"Mitchell State School"]
[3005,"Mitchelton Special School",{"$f":"IF(ISERROR(SEARCH(Workplace_Name,Workplace_Lookup!B800)),0,1)","v":1},{"$f":"IF(C800=0,\"\",COUNTIF($B$2:C800,1))","v":799},"Mitchelton Special School"]
[2040,"Mitchelton State High School",{"$f":"IF(ISERROR(SEARCH(Workplace_Name,Workplace_Lookup!B801)),0,1)","v":1},{"$f":"IF(C801=0,\"\",COUNTIF($B$2:C801,1))","v":800},"Mitchelton State High School"]
[1538,"Mitchelton State School",{"$f":"IF(ISERROR(SEARCH(Workplace_Name,Workplace_Lookup!B802)),0,1)","v":1},{"$f":"IF(C802=0,\"\",COUNTIF($B$2:C802,1))","v":801},"Mitchelton State School"]
[701,"Moffatdale State School",{"$f":"IF(ISERROR(SEARCH(Workplace_Name,Workplace_Lookup!B803)),0,1)","v":1},{"$f":"IF(C803=0,\"\",COUNTIF($B$2:C803,1))","v":802},"Moffatdale State School"]
[73,"Moggill State School",{"$f":"IF(ISERROR(SEARCH(Workplace_Name,Workplace_Lookup!B804)),0,1)","v":1},{"$f":"IF(C804=0,\"\",COUNTIF($B$2:C804,1))","v":803},"Moggill State School"]
[417,"Monkland State School",{"$f":"IF(ISERROR(SEARCH(Workplace_Name,Workplace_Lookup!B805)),0,1)","v":1},{"$f":"IF(C805=0,\"\",COUNTIF($B$2:C805,1))","v":804},"Monkland State School"]
[1513,"Monogorilby State School",{"$f":"IF(ISERROR(SEARCH(Workplace_Name,Workplace_Lookup!B806)),0,1)","v":1},{"$f":"IF(C806=0,\"\",COUNTIF($B$2:C806,1))","v":805},"Monogorilby State School"]
[2098,"Monto State High School",{"$f":"IF(ISERROR(SEARCH(Workplace_Name,Workplace_Lookup!B807)),0,1)","v":1},{"$f":"IF(C807=0,\"\",COUNTIF($B$2:C807,1))","v":806},"Monto State High School"]
[1831,"Monto State School",{"$f":"IF(ISERROR(SEARCH(Workplace_Name,Workplace_Lookup!B808)),0,1)","v":1},{"$f":"IF(C808=0,\"\",COUNTIF($B$2:C808,1))","v":807},"Monto State School"]
[776,"Montville State School",{"$f":"IF(ISERROR(SEARCH(Workplace_Name,Workplace_Lookup!B809)),0,1)","v":1},{"$f":"IF(C809=0,\"\",COUNTIF($B$2:C809,1))","v":808},"Montville State School"]
[1818,"Mooloolaba State School",{"$f":"IF(ISERROR(SEARCH(Workplace_Name,Workplace_Lookup!B810)),0,1)","v":1},{"$f":"IF(C810=0,\"\",COUNTIF($B$2:C810,1))","v":809},"Mooloolaba State School"]
[309,"Mooloolah State School",{"$f":"IF(ISERROR(SEARCH(Workplace_Name,Workplace_Lookup!B811)),0,1)","v":1},{"$f":"IF(C811=0,\"\",COUNTIF($B$2:C811,1))","v":810},"Mooloolah State School"]
[511,"Moonie State School",{"$f":"IF(ISERROR(SEARCH(Workplace_Name,Workplace_Lookup!B812)),0,1)","v":1},{"$f":"IF(C812=0,\"\",COUNTIF($B$2:C812,1))","v":811},"Moonie State School"]
[1739,"Moore Park Beach State School",{"$f":"IF(ISERROR(SEARCH(Workplace_Name,Workplace_Lookup!B813)),0,1)","v":1},{"$f":"IF(C813=0,\"\",COUNTIF($B$2:C813,1))","v":812},"Moore Park Beach State School"]
[1637,"Moorooka State School",{"$f":"IF(ISERROR(SEARCH(Workplace_Name,Workplace_Lookup!B814)),0,1)","v":1},{"$f":"IF(C814=0,\"\",COUNTIF($B$2:C814,1))","v":813},"Moorooka State School"]
[1908,"Moranbah East State School",{"$f":"IF(ISERROR(SEARCH(Workplace_Name,Workplace_Lookup!B815)),0,1)","v":1},{"$f":"IF(C815=0,\"\",COUNTIF($B$2:C815,1))","v":814},"Moranbah East State School"]
[2135,"Moranbah State High School",{"$f":"IF(ISERROR(SEARCH(Workplace_Name,Workplace_Lookup!B816)),0,1)","v":1},{"$f":"IF(C816=0,\"\",COUNTIF($B$2:C816,1))","v":815},"Moranbah State High School"]
[896,"Moranbah State School",{"$f":"IF(ISERROR(SEARCH(Workplace_Name,Workplace_Lookup!B817)),0,1)","v":1},{"$f":"IF(C817=0,\"\",COUNTIF($B$2:C817,1))","v":816},"Moranbah State School"]
[1985,"Morayfield East State School",{"$f":"IF(ISERROR(SEARCH(Workplace_Name,Workplace_Lookup!B818)),0,1)","v":1},{"$f":"IF(C818=0,\"\",COUNTIF($B$2:C818,1))","v":817},"Morayfield East State School"]
[2154,"Morayfield State High School",{"$f":"IF(ISERROR(SEARCH(Workplace_Name,Workplace_Lookup!B819)),0,1)","v":1},{"$f":"IF(C819=0,\"\",COUNTIF($B$2:C819,1))","v":818},"Morayfield State High School"]
[125,"Morayfield State School",{"$f":"IF(ISERROR(SEARCH(Workplace_Name,Workplace_Lookup!B820)),0,1)","v":1},{"$f":"IF(C820=0,\"\",COUNTIF($B$2:C820,1))","v":819},"Morayfield State School"]
[3567,"Moreton Bay Environmental Education Centre",{"$f":"IF(ISERROR(SEARCH(Workplace_Name,Workplace_Lookup!B821)),0,1)","v":1},{"$f":"IF(C821=0,\"\",COUNTIF($B$2:C821,1))","v":820},"Moreton Bay Environmental Education Centre"]
[1753,"Moreton Downs State School",{"$f":"IF(ISERROR(SEARCH(Workplace_Name,Workplace_Lookup!B822)),0,1)","v":1},{"$f":"IF(C822=0,\"\",COUNTIF($B$2:C822,1))","v":821},"Moreton Downs State School"]
[1803,"Morningside State School",{"$f":"IF(ISERROR(SEARCH(Workplace_Name,Workplace_Lookup!B823)),0,1)","v":1},{"$f":"IF(C823=0,\"\",COUNTIF($B$2:C823,1))","v":822},"Morningside State School"]
[291,"Mornington Island State School",{"$f":"IF(ISERROR(SEARCH(Workplace_Name,Workplace_Lookup!B824)),0,1)","v":1},{"$f":"IF(C824=0,\"\",COUNTIF($B$2:C824,1))","v":823},"Mornington Island State School"]
[525,"Morven State School",{"$f":"IF(ISERROR(SEARCH(Workplace_Name,Workplace_Lookup!B825)),0,1)","v":1},{"$f":"IF(C825=0,\"\",COUNTIF($B$2:C825,1))","v":824},"Morven State School"]
[2002,"Mossman State High School",{"$f":"IF(ISERROR(SEARCH(Workplace_Name,Workplace_Lookup!B826)),0,1)","v":1},{"$f":"IF(C826=0,\"\",COUNTIF($B$2:C826,1))","v":825},"Mossman State High School"]
[167,"Mossman State School",{"$f":"IF(ISERROR(SEARCH(Workplace_Name,Workplace_Lookup!B827)),0,1)","v":1},{"$f":"IF(C827=0,\"\",COUNTIF($B$2:C827,1))","v":826},"Mossman State School"]
[381,"Mount Alford State School",{"$f":"IF(ISERROR(SEARCH(Workplace_Name,Workplace_Lookup!B828)),0,1)","v":1},{"$f":"IF(C828=0,\"\",COUNTIF($B$2:C828,1))","v":827},"Mount Alford State School"]
[1914,"Mount Archer State School",{"$f":"IF(ISERROR(SEARCH(Workplace_Name,Workplace_Lookup!B829)),0,1)","v":1},{"$f":"IF(C829=0,\"\",COUNTIF($B$2:C829,1))","v":828},"Mount Archer State School"]
[284,"Mount Cotton State School",{"$f":"IF(ISERROR(SEARCH(Workplace_Name,Workplace_Lookup!B830)),0,1)","v":1},{"$f":"IF(C830=0,\"\",COUNTIF($B$2:C830,1))","v":829},"Mount Cotton State School"]
[267,"Mount Crosby State School",{"$f":"IF(ISERROR(SEARCH(Workplace_Name,Workplace_Lookup!B831)),0,1)","v":1},{"$f":"IF(C831=0,\"\",COUNTIF($B$2:C831,1))","v":830},"Mount Crosby State School"]
[1975,"Mount Fox State School",{"$f":"IF(ISERROR(SEARCH(Workplace_Name,Workplace_Lookup!B832)),0,1)","v":1},{"$f":"IF(C832=0,\"\",COUNTIF($B$2:C832,1))","v":831},"Mount Fox State School"]
[944,"Mount Garnet State School",{"$f":"IF(ISERROR(SEARCH(Workplace_Name,Workplace_Lookup!B833)),0,1)","v":1},{"$f":"IF(C833=0,\"\",COUNTIF($B$2:C833,1))","v":832},"Mount Garnet State School"]
[660,"Mount Gravatt East State School",{"$f":"IF(ISERROR(SEARCH(Workplace_Name,Workplace_Lookup!B834)),0,1)","v":1},{"$f":"IF(C834=0,\"\",COUNTIF($B$2:C834,1))","v":833},"Mount Gravatt East State School"]
[2056,"Mount Gravatt State High School",{"$f":"IF(ISERROR(SEARCH(Workplace_Name,Workplace_Lookup!B835)),0,1)","v":1},{"$f":"IF(C835=0,\"\",COUNTIF($B$2:C835,1))","v":834},"Mount Gravatt State High School"]
[198,"Mount Gravatt State School",{"$f":"IF(ISERROR(SEARCH(Workplace_Name,Workplace_Lookup!B836)),0,1)","v":1},{"$f":"IF(C836=0,\"\",COUNTIF($B$2:C836,1))","v":835},{"$f":"IFERROR(INDEX(B:B,MATCH(ROW(B835),D:D,0)),\"\")","v":"Mount Gravatt State School"}]
[1067,"Mount Isa Central State School",{"$f":"IF(ISERROR(SEARCH(Workplace_Name,Workplace_Lookup!B837)),0,1)","v":1},{"$f":"IF(C837=0,\"\",COUNTIF($B$2:C837,1))","v":836},"Mount Isa Central State School"]
[3604,"Mount Isa School of the Air",{"$f":"IF(ISERROR(SEARCH(Workplace_Name,Workplace_Lookup!B838)),0,1)","v":1},{"$f":"IF(C838=0,\"\",COUNTIF($B$2:C838,1))","v":837},"Mount Isa School of the Air"]
[3004,"Mount Isa Special School",{"$f":"IF(ISERROR(SEARCH(Workplace_Name,Workplace_Lookup!B839)),0,1)","v":1},{"$f":"IF(C839=0,\"\",COUNTIF($B$2:C839,1))","v":838},"Mount Isa Special School"]
[1166,"Mount Kilcoy State School",{"$f":"IF(ISERROR(SEARCH(Workplace_Name,Workplace_Lookup!B840)),0,1)","v":1},{"$f":"IF(C840=0,\"\",COUNTIF($B$2:C840,1))","v":839},"Mount Kilcoy State School"]
[300,"Mount Larcom State School",{"$f":"IF(ISERROR(SEARCH(Workplace_Name,Workplace_Lookup!B841)),0,1)","v":1},{"$f":"IF(C841=0,\"\",COUNTIF($B$2:C841,1))","v":840},"Mount Larcom State School"]
[1189,"Mount Marrow State School",{"$f":"IF(ISERROR(SEARCH(Workplace_Name,Workplace_Lookup!B842)),0,1)","v":1},{"$f":"IF(C842=0,\"\",COUNTIF($B$2:C842,1))","v":841},"Mount Marrow State School"]
[690,"Mount Mee State School",{"$f":"IF(ISERROR(SEARCH(Workplace_Name,Workplace_Lookup!B843)),0,1)","v":1},{"$f":"IF(C843=0,\"\",COUNTIF($B$2:C843,1))","v":842},"Mount Mee State School"]
[1109,"Mount Molloy State School",{"$f":"IF(ISERROR(SEARCH(Workplace_Name,Workplace_Lookup!B844)),0,1)","v":1},{"$f":"IF(C844=0,\"\",COUNTIF($B$2:C844,1))","v":843},"Mount Molloy State School"]
[526,"Mount Morgan Central State School",{"$f":"IF(ISERROR(SEARCH(Workplace_Name,Workplace_Lookup!B845)),0,1)","v":1},{"$f":"IF(C845=0,\"\",COUNTIF($B$2:C845,1))","v":844},"Mount Morgan Central State School"]
[2010,"Mount Morgan State High School",{"$f":"IF(ISERROR(SEARCH(Workplace_Name,Workplace_Lookup!B846)),0,1)","v":1},{"$f":"IF(C846=0,\"\",COUNTIF($B$2:C846,1))","v":845},"Mount Morgan State High School"]
[1511,"Mount Murchison State School",{"$f":"IF(ISERROR(SEARCH(Workplace_Name,Workplace_Lookup!B847)),0,1)","v":1},{"$f":"IF(C847=0,\"\",COUNTIF($B$2:C847,1))","v":846},"Mount Murchison State School"]
[737,"Mount Nebo State School",{"$f":"IF(ISERROR(SEARCH(Workplace_Name,Workplace_Lookup!B848)),0,1)","v":1},{"$f":"IF(C848=0,\"\",COUNTIF($B$2:C848,1))","v":847},"Mount Nebo State School"]
[3088,"Mount Ommaney Special School",{"$f":"IF(ISERROR(SEARCH(Workplace_Name,Workplace_Lookup!B849)),0,1)","v":1},{"$f":"IF(C849=0,\"\",COUNTIF($B$2:C849,1))","v":848},"Mount Ommaney Special School"]
[75,"Mount Perry State School",{"$f":"IF(ISERROR(SEARCH(Workplace_Name,Workplace_Lookup!B850)),0,1)","v":1},{"$f":"IF(C850=0,\"\",COUNTIF($B$2:C850,1))","v":849},"Mount Perry State School"]
[377,"Mount Samson State School",{"$f":"IF(ISERROR(SEARCH(Workplace_Name,Workplace_Lookup!B851)),0,1)","v":1},{"$f":"IF(C851=0,\"\",COUNTIF($B$2:C851,1))","v":850},"Mount Samson State School"]
[1531,"Mount Surprise State School",{"$f":"IF(ISERROR(SEARCH(Workplace_Name,Workplace_Lookup!B852)),0,1)","v":1},{"$f":"IF(C852=0,\"\",COUNTIF($B$2:C852,1))","v":851},"Mount Surprise State School"]
[464,"Mount Sylvia State School",{"$f":"IF(ISERROR(SEARCH(Workplace_Name,Workplace_Lookup!B853)),0,1)","v":1},{"$f":"IF(C853=0,\"\",COUNTIF($B$2:C853,1))","v":852},"Mount Sylvia State School"]
[1111,"Mount Tarampa State School",{"$f":"IF(ISERROR(SEARCH(Workplace_Name,Workplace_Lookup!B854)),0,1)","v":1},{"$f":"IF(C854=0,\"\",COUNTIF($B$2:C854,1))","v":853},"Mount Tarampa State School"]
[1037,"Mount Tyson State School",{"$f":"IF(ISERROR(SEARCH(Workplace_Name,Workplace_Lookup!B855)),0,1)","v":1},{"$f":"IF(C855=0,\"\",COUNTIF($B$2:C855,1))","v":854},"Mount Tyson State School"]
[1906,"Mount Warren Park State School",{"$f":"IF(ISERROR(SEARCH(Workplace_Name,Workplace_Lookup!B856)),0,1)","v":1},{"$f":"IF(C856=0,\"\",COUNTIF($B$2:C856,1))","v":855},"Mount Warren Park State School"]
[495,"Mount Whitestone State School",{"$f":"IF(ISERROR(SEARCH(Workplace_Name,Workplace_Lookup!B857)),0,1)","v":1},{"$f":"IF(C857=0,\"\",COUNTIF($B$2:C857,1))","v":856},"Mount Whitestone State School"]
[2190,"Mountain Creek State High School",{"$f":"IF(ISERROR(SEARCH(Workplace_Name,Workplace_Lookup!B858)),0,1)","v":1},{"$f":"IF(C858=0,\"\",COUNTIF($B$2:C858,1))","v":857},"Mountain Creek State High School"]
[1999,"Mountain Creek State School",{"$f":"IF(ISERROR(SEARCH(Workplace_Name,Workplace_Lookup!B859)),0,1)","v":1},{"$f":"IF(C859=0,\"\",COUNTIF($B$2:C859,1))","v":858},"Mountain Creek State School"]
[2136,"Moura State High School",{"$f":"IF(ISERROR(SEARCH(Workplace_Name,Workplace_Lookup!B860)),0,1)","v":1},{"$f":"IF(C860=0,\"\",COUNTIF($B$2:C860,1))","v":859},"Moura State High School"]
[932,"Moura State School",{"$f":"IF(ISERROR(SEARCH(Workplace_Name,Workplace_Lookup!B861)),0,1)","v":1},{"$f":"IF(C861=0,\"\",COUNTIF($B$2:C861,1))","v":860},"Moura State School"]
[957,"Mourilyan State School",{"$f":"IF(ISERROR(SEARCH(Workplace_Name,Workplace_Lookup!B862)),0,1)","v":1},{"$f":"IF(C862=0,\"\",COUNTIF($B$2:C862,1))","v":861},"Mourilyan State School"]
[159,"Mudgeeraba Creek State School",{"$f":"IF(ISERROR(SEARCH(Workplace_Name,Workplace_Lookup!B863)),0,1)","v":1},{"$f":"IF(C863=0,\"\",COUNTIF($B$2:C863,1))","v":862},"Mudgeeraba Creek State School"]
[3049,"Mudgeeraba Special School",{"$f":"IF(ISERROR(SEARCH(Workplace_Name,Workplace_Lookup!B864)),0,1)","v":1},{"$f":"IF(C864=0,\"\",COUNTIF($B$2:C864,1))","v":863},"Mudgeeraba Special School"]
[663,"Mudgeeraba State School",{"$f":"IF(ISERROR(SEARCH(Workplace_Name,Workplace_Lookup!B865)),0,1)","v":1},{"$f":"IF(C865=0,\"\",COUNTIF($B$2:C865,1))","v":864},"Mudgeeraba State School"]
[1418,"Mulgildie State School",{"$f":"IF(ISERROR(SEARCH(Workplace_Name,Workplace_Lookup!B866)),0,1)","v":1},{"$f":"IF(C866=0,\"\",COUNTIF($B$2:C866,1))","v":865},"Mulgildie State School"]
[436,"Mundingburra State School",{"$f":"IF(ISERROR(SEARCH(Workplace_Name,Workplace_Lookup!B867)),0,1)","v":1},{"$f":"IF(C867=0,\"\",COUNTIF($B$2:C867,1))","v":866},"Mundingburra State School"]
[722,"Mundoo State School",{"$f":"IF(ISERROR(SEARCH(Workplace_Name,Workplace_Lookup!B868)),0,1)","v":1},{"$f":"IF(C868=0,\"\",COUNTIF($B$2:C868,1))","v":867},"Mundoo State School"]
[1420,"Mundubbera State College",{"$f":"IF(ISERROR(SEARCH(Workplace_Name,Workplace_Lookup!B869)),0,1)","v":1},{"$f":"IF(C869=0,\"\",COUNTIF($B$2:C869,1))","v":868},"Mundubbera State College"]
[507,"Mungallala State School",{"$f":"IF(ISERROR(SEARCH(Workplace_Name,Workplace_Lookup!B870)),0,1)","v":1},{"$f":"IF(C870=0,\"\",COUNTIF($B$2:C870,1))","v":869},"Mungallala State School"]
[217,"Mungar State School",{"$f":"IF(ISERROR(SEARCH(Workplace_Name,Workplace_Lookup!B871)),0,1)","v":1},{"$f":"IF(C871=0,\"\",COUNTIF($B$2:C871,1))","v":870},"Mungar State School"]
[1469,"Murarrie State School",{"$f":"IF(ISERROR(SEARCH(Workplace_Name,Workplace_Lookup!B872)),0,1)","v":1},{"$f":"IF(C872=0,\"\",COUNTIF($B$2:C872,1))","v":871},"Murarrie State School"]
[2052,"Murgon State High School",{"$f":"IF(ISERROR(SEARCH(Workplace_Name,Workplace_Lookup!B873)),0,1)","v":1},{"$f":"IF(C873=0,\"\",COUNTIF($B$2:C873,1))","v":872},"Murgon State High School"]
[871,"Murgon State School",{"$f":"IF(ISERROR(SEARCH(Workplace_Name,Workplace_Lookup!B874)),0,1)","v":1},{"$f":"IF(C874=0,\"\",COUNTIF($B$2:C874,1))","v":873},"Murgon State School"]
[76,"Murphy's Creek State School",{"$f":"IF(ISERROR(SEARCH(Workplace_Name,Workplace_Lookup!B875)),0,1)","v":1},{"$f":"IF(C875=0,\"\",COUNTIF($B$2:C875,1))","v":874},"Murphy's Creek State School"]
[1030,"Murray River Upper State School",{"$f":"IF(ISERROR(SEARCH(Workplace_Name,Workplace_Lookup!B876)),0,1)","v":1},{"$f":"IF(C876=0,\"\",COUNTIF($B$2:C876,1))","v":875},"Murray River Upper State School"]
[1177,"Murray's Bridge State School",{"$f":"IF(ISERROR(SEARCH(Workplace_Name,Workplace_Lookup!B877)),0,1)","v":1},{"$f":"IF(C877=0,\"\",COUNTIF($B$2:C877,1))","v":876},"Murray's Bridge State School"]
[7574,"Murrumba State Secondary College",{"$f":"IF(ISERROR(SEARCH(Workplace_Name,Workplace_Lookup!B878)),0,1)","v":1},{"$f":"IF(C878=0,\"\",COUNTIF($B$2:C878,1))","v":877},"Murrumba State Secondary College"]
[1678,"Musgrave Hill State School",{"$f":"IF(ISERROR(SEARCH(Workplace_Name,Workplace_Lookup!B879)),0,1)","v":1},{"$f":"IF(C879=0,\"\",COUNTIF($B$2:C879,1))","v":878},"Musgrave Hill State School"]
[1317,"Mutarnee State School",{"$f":"IF(ISERROR(SEARCH(Workplace_Name,Workplace_Lookup!B880)),0,1)","v":1},{"$f":"IF(C880=0,\"\",COUNTIF($B$2:C880,1))","v":879},"Mutarnee State School"]
[993,"Mutchilba State School",{"$f":"IF(ISERROR(SEARCH(Workplace_Name,Workplace_Lookup!B881)),0,1)","v":1},{"$f":"IF(C881=0,\"\",COUNTIF($B$2:C881,1))","v":880},"Mutchilba State School"]
[152,"Mutdapilly State School",{"$f":"IF(ISERROR(SEARCH(Workplace_Name,Workplace_Lookup!B882)),0,1)","v":1},{"$f":"IF(C882=0,\"\",COUNTIF($B$2:C882,1))","v":881},"Mutdapilly State School"]
[304,"Muttaburra State School",{"$f":"IF(ISERROR(SEARCH(Workplace_Name,Workplace_Lookup!B883)),0,1)","v":1},{"$f":"IF(C883=0,\"\",COUNTIF($B$2:C883,1))","v":882},"Muttaburra State School"]
[1481,"Nagoorin State School",{"$f":"IF(ISERROR(SEARCH(Workplace_Name,Workplace_Lookup!B884)),0,1)","v":1},{"$f":"IF(C884=0,\"\",COUNTIF($B$2:C884,1))","v":883},"Nagoorin State School"]
[3039,"Nambour Special School",{"$f":"IF(ISERROR(SEARCH(Workplace_Name,Workplace_Lookup!B885)),0,1)","v":1},{"$f":"IF(C885=0,\"\",COUNTIF($B$2:C885,1))","v":884},"Nambour Special School"]
[2031,"Nambour State College",{"$f":"IF(ISERROR(SEARCH(Workplace_Name,Workplace_Lookup!B886)),0,1)","v":1},{"$f":"IF(C886=0,\"\",COUNTIF($B$2:C886,1))","v":885},"Nambour State College"]
[363,"Nambour State College - Junior School",{"$f":"IF(ISERROR(SEARCH(Workplace_Name,Workplace_Lookup!B887)),0,1)","v":1},{"$f":"IF(C887=0,\"\",COUNTIF($B$2:C887,1))","v":886},"Nambour State College - Junior School"]
[2157,"Nanango State High School",{"$f":"IF(ISERROR(SEARCH(Workplace_Name,Workplace_Lookup!B888)),0,1)","v":1},{"$f":"IF(C888=0,\"\",COUNTIF($B$2:C888,1))","v":887},"Nanango State High School"]
[77,"Nanango State School",{"$f":"IF(ISERROR(SEARCH(Workplace_Name,Workplace_Lookup!B889)),0,1)","v":1},{"$f":"IF(C889=0,\"\",COUNTIF($B$2:C889,1))","v":888},"Nanango State School"]
[1200,"Narangba State School",{"$f":"IF(ISERROR(SEARCH(Workplace_Name,Workplace_Lookup!B890)),0,1)","v":1},{"$f":"IF(C890=0,\"\",COUNTIF($B$2:C890,1))","v":889},"Narangba State School"]
[444,"Narangba Valley State High School",{"$f":"IF(ISERROR(SEARCH(Workplace_Name,Workplace_Lookup!B891)),0,1)","v":1},{"$f":"IF(C891=0,\"\",COUNTIF($B$2:C891,1))","v":890},"Narangba Valley State High School"]
[1725,"Narangba Valley State School",{"$f":"IF(ISERROR(SEARCH(Workplace_Name,Workplace_Lookup!B892)),0,1)","v":1},{"$f":"IF(C892=0,\"\",COUNTIF($B$2:C892,1))","v":891},"Narangba Valley State School"]
[3140,"Narbethong State Special School",{"$f":"IF(ISERROR(SEARCH(Workplace_Name,Workplace_Lookup!B893)),0,1)","v":1},{"$f":"IF(C893=0,\"\",COUNTIF($B$2:C893,1))","v":892},"Narbethong State Special School"]
[479,"Nashville State School",{"$f":"IF(ISERROR(SEARCH(Workplace_Name,Workplace_Lookup!B894)),0,1)","v":1},{"$f":"IF(C894=0,\"\",COUNTIF($B$2:C894,1))","v":893},"Nashville State School"]
[184,"Nebo State School",{"$f":"IF(ISERROR(SEARCH(Workplace_Name,Workplace_Lookup!B895)),0,1)","v":1},{"$f":"IF(C895=0,\"\",COUNTIF($B$2:C895,1))","v":894},"Nebo State School"]
[2169,"Nerang State High School",{"$f":"IF(ISERROR(SEARCH(Workplace_Name,Workplace_Lookup!B896)),0,1)","v":1},{"$f":"IF(C896=0,\"\",COUNTIF($B$2:C896,1))","v":895},"Nerang State High School"]
[218,"Nerang State School",{"$f":"IF(ISERROR(SEARCH(Workplace_Name,Workplace_Lookup!B897)),0,1)","v":1},{"$f":"IF(C897=0,\"\",COUNTIF($B$2:C897,1))","v":896},"Nerang State School"]
[943,"New Farm State School",{"$f":"IF(ISERROR(SEARCH(Workplace_Name,Workplace_Lookup!B898)),0,1)","v":1},{"$f":"IF(C898=0,\"\",COUNTIF($B$2:C898,1))","v":897},"New Farm State School"]
[228,"Newmarket State School",{"$f":"IF(ISERROR(SEARCH(Workplace_Name,Workplace_Lookup!B899)),0,1)","v":1},{"$f":"IF(C899=0,\"\",COUNTIF($B$2:C899,1))","v":898},"Newmarket State School"]
[1227,"Newtown State School",{"$f":"IF(ISERROR(SEARCH(Workplace_Name,Workplace_Lookup!B900)),0,1)","v":1},{"$f":"IF(C900=0,\"\",COUNTIF($B$2:C900,1))","v":899},{"$f":"IFERROR(INDEX(B:B,MATCH(ROW(B899),D:D,0)),\"\")","v":"Newtown State School"}]
["B018","Nirimba State Primary School",{"$f":"IF(ISERROR(SEARCH(Workplace_Name,Workplace_Lookup!B901)),0,1)","v":1},{"$f":"IF(C901=0,\"\",COUNTIF($B$2:C901,1))","v":900},"Nirimba State Primary School"]
[1735,"Nobby State School",{"$f":"IF(ISERROR(SEARCH(Workplace_Name,Workplace_Lookup!B902)),0,1)","v":1},{"$f":"IF(C902=0,\"\",COUNTIF($B$2:C902,1))","v":901},"Nobby State School"]
[2088,"Noosa District State High School",{"$f":"IF(ISERROR(SEARCH(Workplace_Name,Workplace_Lookup!B903)),0,1)","v":1},{"$f":"IF(C903=0,\"\",COUNTIF($B$2:C903,1))","v":902},"Noosa District State High School"]
[2292,"Noosa District State High School - Pomona Campus",{"$f":"IF(ISERROR(SEARCH(Workplace_Name,Workplace_Lookup!B904)),0,1)","v":1},{"$f":"IF(C904=0,\"\",COUNTIF($B$2:C904,1))","v":903},"Noosa District State High School - Pomona Campus"]
[175,"Noosaville State School",{"$f":"IF(ISERROR(SEARCH(Workplace_Name,Workplace_Lookup!B905)),0,1)","v":1},{"$f":"IF(C905=0,\"\",COUNTIF($B$2:C905,1))","v":904},"Noosaville State School"]
["B059","Norfolk Island Central School",{"$f":"IF(ISERROR(SEARCH(Workplace_Name,Workplace_Lookup!B906)),0,1)","v":1},{"$f":"IF(C906=0,\"\",COUNTIF($B$2:C906,1))","v":905},"Norfolk Island Central School"]
[1741,"Norfolk Village State School",{"$f":"IF(ISERROR(SEARCH(Workplace_Name,Workplace_Lookup!B907)),0,1)","v":1},{"$f":"IF(C907=0,\"\",COUNTIF($B$2:C907,1))","v":906},"Norfolk Village State School"]
[926,"Norman Park State School",{"$f":"IF(ISERROR(SEARCH(Workplace_Name,Workplace_Lookup!B908)),0,1)","v":1},{"$f":"IF(C908=0,\"\",COUNTIF($B$2:C908,1))","v":907},"Norman Park State School"]
[360,"Normanton State School",{"$f":"IF(ISERROR(SEARCH(Workplace_Name,Workplace_Lookup!B909)),0,1)","v":1},{"$f":"IF(C909=0,\"\",COUNTIF($B$2:C909,1))","v":908},"Normanton State School"]
[1863,"Norris Road State School",{"$f":"IF(ISERROR(SEARCH(Workplace_Name,Workplace_Lookup!B910)),0,1)","v":1},{"$f":"IF(C910=0,\"\",COUNTIF($B$2:C910,1))","v":909},"Norris Road State School"]
[469,"North Arm State School",{"$f":"IF(ISERROR(SEARCH(Workplace_Name,Workplace_Lookup!B911)),0,1)","v":1},{"$f":"IF(C911=0,\"\",COUNTIF($B$2:C911,1))","v":910},"North Arm State School"]
[6670,"North Coast Region - Bundaberg Office",{"$f":"IF(ISERROR(SEARCH(Workplace_Name,Workplace_Lookup!B912)),0,1)","v":1},{"$f":"IF(C912=0,\"\",COUNTIF($B$2:C912,1))","v":911},"North Coast Region - Bundaberg Office"]
[7586,"North Coast Region - Maroochydore Office",{"$f":"IF(ISERROR(SEARCH(Workplace_Name,Workplace_Lookup!B913)),0,1)","v":1},{"$f":"IF(C913=0,\"\",COUNTIF($B$2:C913,1))","v":912},"North Coast Region - Maroochydore Office"]
[6671,"North Coast Region - Maryborough Office",{"$f":"IF(ISERROR(SEARCH(Workplace_Name,Workplace_Lookup!B914)),0,1)","v":1},{"$f":"IF(C914=0,\"\",COUNTIF($B$2:C914,1))","v":913},"North Coast Region - Maryborough Office"]
[9923,"North Coast Region - North Lakes Office",{"$f":"IF(ISERROR(SEARCH(Workplace_Name,Workplace_Lookup!B915)),0,1)","v":1},{"$f":"IF(C915=0,\"\",COUNTIF($B$2:C915,1))","v":914},"North Coast Region - North Lakes Office"]
[731,"North Eton State School",{"$f":"IF(ISERROR(SEARCH(Workplace_Name,Workplace_Lookup!B916)),0,1)","v":1},{"$f":"IF(C916=0,\"\",COUNTIF($B$2:C916,1))","v":915},"North Eton State School"]
[2324,"North Lakes State College",{"$f":"IF(ISERROR(SEARCH(Workplace_Name,Workplace_Lookup!B917)),0,1)","v":1},{"$f":"IF(C917=0,\"\",COUNTIF($B$2:C917,1))","v":916},"North Lakes State College"]
[6646,"North Queensland Region - Mount Isa Office",{"$f":"IF(ISERROR(SEARCH(Workplace_Name,Workplace_Lookup!B918)),0,1)","v":1},{"$f":"IF(C918=0,\"\",COUNTIF($B$2:C918,1))","v":917},"North Queensland Region - Mount Isa Office"]
[6644,"North Queensland Region - Townsville Office",{"$f":"IF(ISERROR(SEARCH(Workplace_Name,Workplace_Lookup!B919)),0,1)","v":1},{"$f":"IF(C919=0,\"\",COUNTIF($B$2:C919,1))","v":918},"North Queensland Region - Townsville Office"]
[2041,"North Rockhampton State High School",{"$f":"IF(ISERROR(SEARCH(Workplace_Name,Workplace_Lookup!B920)),0,1)","v":1},{"$f":"IF(C920=0,\"\",COUNTIF($B$2:C920,1))","v":919},"North Rockhampton State High School"]
["A069","North Shore State School",{"$f":"IF(ISERROR(SEARCH(Workplace_Name,Workplace_Lookup!B921)),0,1)","v":1},{"$f":"IF(C921=0,\"\",COUNTIF($B$2:C921,1))","v":920},"North Shore State School"]
[211,"Northern Beaches State High School",{"$f":"IF(ISERROR(SEARCH(Workplace_Name,Workplace_Lookup!B922)),0,1)","v":1},{"$f":"IF(C922=0,\"\",COUNTIF($B$2:C922,1))","v":921},"Northern Beaches State High School"]
[5704,"Northern Peninsula Area College - Ama Mary Eseli Injinoo Campus",{"$f":"IF(ISERROR(SEARCH(Workplace_Name,Workplace_Lookup!B923)),0,1)","v":1},{"$f":"IF(C923=0,\"\",COUNTIF($B$2:C923,1))","v":922},"Northern Peninsula Area College - Ama Mary Eseli Injinoo Campus"]
[5703,"Northern Peninsula Area College - Bamaga Junior Campus",{"$f":"IF(ISERROR(SEARCH(Workplace_Name,Workplace_Lookup!B924)),0,1)","v":1},{"$f":"IF(C924=0,\"\",COUNTIF($B$2:C924,1))","v":923},"Northern Peninsula Area College - Bamaga Junior Campus"]
[1243,"Northern Peninsula Area State College",{"$f":"IF(ISERROR(SEARCH(Workplace_Name,Workplace_Lookup!B925)),0,1)","v":1},{"$f":"IF(C925=0,\"\",COUNTIF($B$2:C925,1))","v":924},"Northern Peninsula Area State College"]
[5971,"Northern Peninsula Area State College - Senior Campus",{"$f":"IF(ISERROR(SEARCH(Workplace_Name,Workplace_Lookup!B926)),0,1)","v":1},{"$f":"IF(C926=0,\"\",COUNTIF($B$2:C926,1))","v":925},"Northern Peninsula Area State College - Senior Campus"]
[281,"Northgate State School",{"$f":"IF(ISERROR(SEARCH(Workplace_Name,Workplace_Lookup!B927)),0,1)","v":1},{"$f":"IF(C927=0,\"\",COUNTIF($B$2:C927,1))","v":926},"Northgate State School"]
[1957,"Northview State School",{"$f":"IF(ISERROR(SEARCH(Workplace_Name,Workplace_Lookup!B928)),0,1)","v":1},{"$f":"IF(C928=0,\"\",COUNTIF($B$2:C928,1))","v":927},"Northview State School"]
[445,"Norville State School",{"$f":"IF(ISERROR(SEARCH(Workplace_Name,Workplace_Lookup!B929)),0,1)","v":1},{"$f":"IF(C929=0,\"\",COUNTIF($B$2:C929,1))","v":928},"Norville State School"]
[3590,"Nudgee Beach Environmental Education Centre",{"$f":"IF(ISERROR(SEARCH(Workplace_Name,Workplace_Lookup!B930)),0,1)","v":1},{"$f":"IF(C930=0,\"\",COUNTIF($B$2:C930,1))","v":929},"Nudgee Beach Environmental Education Centre"]
[3558,"Numinbah Valley Environmental Education Centre",{"$f":"IF(ISERROR(SEARCH(Workplace_Name,Workplace_Lookup!B931)),0,1)","v":1},{"$f":"IF(C931=0,\"\",COUNTIF($B$2:C931,1))","v":930},"Numinbah Valley Environmental Education Centre"]
[785,"Numinbah Valley State School",{"$f":"IF(ISERROR(SEARCH(Workplace_Name,Workplace_Lookup!B932)),0,1)","v":1},{"$f":"IF(C932=0,\"\",COUNTIF($B$2:C932,1))","v":931},"Numinbah Valley State School"]
[43,"Nundah State School",{"$f":"IF(ISERROR(SEARCH(Workplace_Name,Workplace_Lookup!B933)),0,1)","v":1},{"$f":"IF(C933=0,\"\",COUNTIF($B$2:C933,1))","v":932},"Nundah State School"]
[3084,"Nursery Road State Special School",{"$f":"IF(ISERROR(SEARCH(Workplace_Name,Workplace_Lookup!B934)),0,1)","v":1},{"$f":"IF(C934=0,\"\",COUNTIF($B$2:C934,1))","v":933},"Nursery Road State Special School"]
[1238,"Oakenden State School",{"$f":"IF(ISERROR(SEARCH(Workplace_Name,Workplace_Lookup!B935)),0,1)","v":1},{"$f":"IF(C935=0,\"\",COUNTIF($B$2:C935,1))","v":934},"Oakenden State School"]
[2099,"Oakey State High School",{"$f":"IF(ISERROR(SEARCH(Workplace_Name,Workplace_Lookup!B936)),0,1)","v":1},{"$f":"IF(C936=0,\"\",COUNTIF($B$2:C936,1))","v":935},"Oakey State High School"]
[166,"Oakey State School",{"$f":"IF(ISERROR(SEARCH(Workplace_Name,Workplace_Lookup!B937)),0,1)","v":1},{"$f":"IF(C937=0,\"\",COUNTIF($B$2:C937,1))","v":936},"Oakey State School"]
[331,"Oakleigh State School",{"$f":"IF(ISERROR(SEARCH(Workplace_Name,Workplace_Lookup!B938)),0,1)","v":1},{"$f":"IF(C938=0,\"\",COUNTIF($B$2:C938,1))","v":937},"Oakleigh State School"]
[620,"Oakwood State School",{"$f":"IF(ISERROR(SEARCH(Workplace_Name,Workplace_Lookup!B939)),0,1)","v":1},{"$f":"IF(C939=0,\"\",COUNTIF($B$2:C939,1))","v":938},"Oakwood State School"]
[51,"One Mile State School",{"$f":"IF(ISERROR(SEARCH(Workplace_Name,Workplace_Lookup!B940)),0,1)","v":1},{"$f":"IF(C940=0,\"\",COUNTIF($B$2:C940,1))","v":939},"One Mile State School"]
[556,"Oonoonba State School",{"$f":"IF(ISERROR(SEARCH(Workplace_Name,Workplace_Lookup!B941)),0,1)","v":1},{"$f":"IF(C941=0,\"\",COUNTIF($B$2:C941,1))","v":940},"Oonoonba State School"]
[6555,"Organisational Safety and Wellbeing",{"$f":"IF(ISERROR(SEARCH(Workplace_Name,Workplace_Lookup!B942)),0,1)","v":1},{"$f":"IF(C942=0,\"\",COUNTIF($B$2:C942,1))","v":941},"Organisational Safety and Wellbeing"]
[1271,"Orion State School",{"$f":"IF(ISERROR(SEARCH(Workplace_Name,Workplace_Lookup!B943)),0,1)","v":1},{"$f":"IF(C943=0,\"\",COUNTIF($B$2:C943,1))","v":942},"Orion State School"]
[336,"Ormeau State School",{"$f":"IF(ISERROR(SEARCH(Workplace_Name,Workplace_Lookup!B944)),0,1)","v":1},{"$f":"IF(C944=0,\"\",COUNTIF($B$2:C944,1))","v":943},"Ormeau State School"]
[6136,"Ormeau Woods State High School",{"$f":"IF(ISERROR(SEARCH(Workplace_Name,Workplace_Lookup!B945)),0,1)","v":1},{"$f":"IF(C945=0,\"\",COUNTIF($B$2:C945,1))","v":944},"Ormeau Woods State High School"]
[23,"Ormiston State School",{"$f":"IF(ISERROR(SEARCH(Workplace_Name,Workplace_Lookup!B946)),0,1)","v":1},{"$f":"IF(C946=0,\"\",COUNTIF($B$2:C946,1))","v":945},"Ormiston State School"]
[74,"Osborne State School",{"$f":"IF(ISERROR(SEARCH(Workplace_Name,Workplace_Lookup!B947)),0,1)","v":1},{"$f":"IF(C947=0,\"\",COUNTIF($B$2:C947,1))","v":946},"Osborne State School"]
[1970,"Oxenford State School",{"$f":"IF(ISERROR(SEARCH(Workplace_Name,Workplace_Lookup!B948)),0,1)","v":1},{"$f":"IF(C948=0,\"\",COUNTIF($B$2:C948,1))","v":947},"Oxenford State School"]
[79,"Oxley State School",{"$f":"IF(ISERROR(SEARCH(Workplace_Name,Workplace_Lookup!B949)),0,1)","v":1},{"$f":"IF(C949=0,\"\",COUNTIF($B$2:C949,1))","v":948},"Oxley State School"]
[1991,"Pacific Paradise State School",{"$f":"IF(ISERROR(SEARCH(Workplace_Name,Workplace_Lookup!B950)),0,1)","v":1},{"$f":"IF(C950=0,\"\",COUNTIF($B$2:C950,1))","v":949},"Pacific Paradise State School"]
[1745,"Pacific Pines State High School",{"$f":"IF(ISERROR(SEARCH(Workplace_Name,Workplace_Lookup!B951)),0,1)","v":1},{"$f":"IF(C951=0,\"\",COUNTIF($B$2:C951,1))","v":950},"Pacific Pines State High School"]
[1744,"Pacific Pines State School",{"$f":"IF(ISERROR(SEARCH(Workplace_Name,Workplace_Lookup!B952)),0,1)","v":1},{"$f":"IF(C952=0,\"\",COUNTIF($B$2:C952,1))","v":951},"Pacific Pines State School"]
[831,"Pallara State School",{"$f":"IF(ISERROR(SEARCH(Workplace_Name,Workplace_Lookup!B953)),0,1)","v":1},{"$f":"IF(C953=0,\"\",COUNTIF($B$2:C953,1))","v":952},"Pallara State School"]
[240,"Palm Beach State School",{"$f":"IF(ISERROR(SEARCH(Workplace_Name,Workplace_Lookup!B954)),0,1)","v":1},{"$f":"IF(C954=0,\"\",COUNTIF($B$2:C954,1))","v":953},"Palm Beach State School"]
[2129,"Palm Beach-Currumbin State High School",{"$f":"IF(ISERROR(SEARCH(Workplace_Name,Workplace_Lookup!B955)),0,1)","v":1},{"$f":"IF(C955=0,\"\",COUNTIF($B$2:C955,1))","v":954},"Palm Beach-Currumbin State High School"]
["A907","Palmview State Primary School",{"$f":"IF(ISERROR(SEARCH(Workplace_Name,Workplace_Lookup!B956)),0,1)","v":1},{"$f":"IF(C956=0,\"\",COUNTIF($B$2:C956,1))","v":955},"Palmview State Primary School"]
["A906","Palmview State Secondary College",{"$f":"IF(ISERROR(SEARCH(Workplace_Name,Workplace_Lookup!B957)),0,1)","v":1},{"$f":"IF(C957=0,\"\",COUNTIF($B$2:C957,1))","v":956},"Palmview State Secondary College"]
["A905","Palmview State Special School",{"$f":"IF(ISERROR(SEARCH(Workplace_Name,Workplace_Lookup!B958)),0,1)","v":1},{"$f":"IF(C958=0,\"\",COUNTIF($B$2:C958,1))","v":957},"Palmview State Special School"]
[592,"Palmwoods State School",{"$f":"IF(ISERROR(SEARCH(Workplace_Name,Workplace_Lookup!B959)),0,1)","v":1},{"$f":"IF(C959=0,\"\",COUNTIF($B$2:C959,1))","v":958},"Palmwoods State School"]
[3568,"Paluma Environmental Education Centre",{"$f":"IF(ISERROR(SEARCH(Workplace_Name,Workplace_Lookup!B960)),0,1)","v":1},{"$f":"IF(C960=0,\"\",COUNTIF($B$2:C960,1))","v":959},"Paluma Environmental Education Centre"]
[983,"Park Avenue State School",{"$f":"IF(ISERROR(SEARCH(Workplace_Name,Workplace_Lookup!B961)),0,1)","v":1},{"$f":"IF(C961=0,\"\",COUNTIF($B$2:C961,1))","v":960},"Park Avenue State School"]
[5700,"Park Lake State School",{"$f":"IF(ISERROR(SEARCH(Workplace_Name,Workplace_Lookup!B962)),0,1)","v":1},{"$f":"IF(C962=0,\"\",COUNTIF($B$2:C962,1))","v":961},"Park Lake State School"]
[2187,"Park Ridge State High School",{"$f":"IF(ISERROR(SEARCH(Workplace_Name,Workplace_Lookup!B963)),0,1)","v":1},{"$f":"IF(C963=0,\"\",COUNTIF($B$2:C963,1))","v":962},"Park Ridge State High School"]
[515,"Park Ridge State School",{"$f":"IF(ISERROR(SEARCH(Workplace_Name,Workplace_Lookup!B964)),0,1)","v":1},{"$f":"IF(C964=0,\"\",COUNTIF($B$2:C964,1))","v":963},{"$f":"IFERROR(INDEX(B:B,MATCH(ROW(B963),D:D,0)),\"\")","v":"Park Ridge State School"}]
[1467,"Parke State School",{"$f":"IF(ISERROR(SEARCH(Workplace_Name,Workplace_Lookup!B965)),0,1)","v":1},{"$f":"IF(C965=0,\"\",COUNTIF($B$2:C965,1))","v":964},"Parke State School"]
[922,"Parkhurst State School",{"$f":"IF(ISERROR(SEARCH(Workplace_Name,Workplace_Lookup!B966)),0,1)","v":1},{"$f":"IF(C966=0,\"\",COUNTIF($B$2:C966,1))","v":965},"Parkhurst State School"]
[639,"Parramatta State School",{"$f":"IF(ISERROR(SEARCH(Workplace_Name,Workplace_Lookup!B967)),0,1)","v":1},{"$f":"IF(C967=0,\"\",COUNTIF($B$2:C967,1))","v":966},"Parramatta State School"]
[1486,"Patrick Estate State School",{"$f":"IF(ISERROR(SEARCH(Workplace_Name,Workplace_Lookup!B968)),0,1)","v":1},{"$f":"IF(C968=0,\"\",COUNTIF($B$2:C968,1))","v":967},"Patrick Estate State School"]
[1864,"Patricks Road State School",{"$f":"IF(ISERROR(SEARCH(Workplace_Name,Workplace_Lookup!B969)),0,1)","v":1},{"$f":"IF(C969=0,\"\",COUNTIF($B$2:C969,1))","v":968},"Patricks Road State School"]
[286,"Payne Road State School",{"$f":"IF(ISERROR(SEARCH(Workplace_Name,Workplace_Lookup!B970)),0,1)","v":1},{"$f":"IF(C970=0,\"\",COUNTIF($B$2:C970,1))","v":969},"Payne Road State School"]
[672,"Peachester State School",{"$f":"IF(ISERROR(SEARCH(Workplace_Name,Workplace_Lookup!B971)),0,1)","v":1},{"$f":"IF(C971=0,\"\",COUNTIF($B$2:C971,1))","v":970},"Peachester State School"]
[86,"Peak Crossing State School",{"$f":"IF(ISERROR(SEARCH(Workplace_Name,Workplace_Lookup!B972)),0,1)","v":1},{"$f":"IF(C972=0,\"\",COUNTIF($B$2:C972,1))","v":971},"Peak Crossing State School"]
[467,"Pentland State School",{"$f":"IF(ISERROR(SEARCH(Workplace_Name,Workplace_Lookup!B973)),0,1)","v":1},{"$f":"IF(C973=0,\"\",COUNTIF($B$2:C973,1))","v":972},"Pentland State School"]
[1712,"Peregian Springs State School",{"$f":"IF(ISERROR(SEARCH(Workplace_Name,Workplace_Lookup!B974)),0,1)","v":1},{"$f":"IF(C974=0,\"\",COUNTIF($B$2:C974,1))","v":973},"Peregian Springs State School"]
[183,"Petrie State School",{"$f":"IF(ISERROR(SEARCH(Workplace_Name,Workplace_Lookup!B975)),0,1)","v":1},{"$f":"IF(C975=0,\"\",COUNTIF($B$2:C975,1))","v":974},"Petrie State School"]
[80,"Petrie Terrace State School",{"$f":"IF(ISERROR(SEARCH(Workplace_Name,Workplace_Lookup!B976)),0,1)","v":1},{"$f":"IF(C976=0,\"\",COUNTIF($B$2:C976,1))","v":975},"Petrie Terrace State School"]
[419,"Pialba State School",{"$f":"IF(ISERROR(SEARCH(Workplace_Name,Workplace_Lookup!B977)),0,1)","v":1},{"$f":"IF(C977=0,\"\",COUNTIF($B$2:C977,1))","v":976},"Pialba State School"]
[9315,"Picnic Creek State School",{"$f":"IF(ISERROR(SEARCH(Workplace_Name,Workplace_Lookup!B978)),0,1)","v":1},{"$f":"IF(C978=0,\"\",COUNTIF($B$2:C978,1))","v":977},"Picnic Creek State School"]
[422,"Pilton State School",{"$f":"IF(ISERROR(SEARCH(Workplace_Name,Workplace_Lookup!B979)),0,1)","v":1},{"$f":"IF(C979=0,\"\",COUNTIF($B$2:C979,1))","v":978},"Pilton State School"]
[2049,"Pimlico State High School",{"$f":"IF(ISERROR(SEARCH(Workplace_Name,Workplace_Lookup!B980)),0,1)","v":1},{"$f":"IF(C980=0,\"\",COUNTIF($B$2:C980,1))","v":979},"Pimlico State High School"]
[9331,"Pimpama State Primary College",{"$f":"IF(ISERROR(SEARCH(Workplace_Name,Workplace_Lookup!B981)),0,1)","v":1},{"$f":"IF(C981=0,\"\",COUNTIF($B$2:C981,1))","v":980},"Pimpama State Primary College"]
[81,"Pimpama State School",{"$f":"IF(ISERROR(SEARCH(Workplace_Name,Workplace_Lookup!B982)),0,1)","v":1},{"$f":"IF(C982=0,\"\",COUNTIF($B$2:C982,1))","v":981},"Pimpama State School"]
[8044,"Pimpama State Secondary College",{"$f":"IF(ISERROR(SEARCH(Workplace_Name,Workplace_Lookup!B983)),0,1)","v":1},{"$f":"IF(C983=0,\"\",COUNTIF($B$2:C983,1))","v":982},"Pimpama State Secondary College"]
[1408,"Pindi Pindi State School",{"$f":"IF(ISERROR(SEARCH(Workplace_Name,Workplace_Lookup!B984)),0,1)","v":1},{"$f":"IF(C984=0,\"\",COUNTIF($B$2:C984,1))","v":983},"Pindi Pindi State School"]
[3011,"Pine Rivers Special School",{"$f":"IF(ISERROR(SEARCH(Workplace_Name,Workplace_Lookup!B985)),0,1)","v":1},{"$f":"IF(C985=0,\"\",COUNTIF($B$2:C985,1))","v":984},"Pine Rivers Special School"]
[2102,"Pine Rivers State High School",{"$f":"IF(ISERROR(SEARCH(Workplace_Name,Workplace_Lookup!B986)),0,1)","v":1},{"$f":"IF(C986=0,\"\",COUNTIF($B$2:C986,1))","v":985},"Pine Rivers State High School"]
[1141,"Pinnacle State School",{"$f":"IF(ISERROR(SEARCH(Workplace_Name,Workplace_Lookup!B987)),0,1)","v":1},{"$f":"IF(C987=0,\"\",COUNTIF($B$2:C987,1))","v":986},"Pinnacle State School"]
[2168,"Pioneer State High School",{"$f":"IF(ISERROR(SEARCH(Workplace_Name,Workplace_Lookup!B988)),0,1)","v":1},{"$f":"IF(C988=0,\"\",COUNTIF($B$2:C988,1))","v":987},"Pioneer State High School"]
[2119,"Pittsworth State High School",{"$f":"IF(ISERROR(SEARCH(Workplace_Name,Workplace_Lookup!B989)),0,1)","v":1},{"$f":"IF(C989=0,\"\",COUNTIF($B$2:C989,1))","v":988},"Pittsworth State High School"]
[373,"Pittsworth State School",{"$f":"IF(ISERROR(SEARCH(Workplace_Name,Workplace_Lookup!B990)),0,1)","v":1},{"$f":"IF(C990=0,\"\",COUNTIF($B$2:C990,1))","v":989},"Pittsworth State School"]
[720,"Pomona State School",{"$f":"IF(ISERROR(SEARCH(Workplace_Name,Workplace_Lookup!B991)),0,1)","v":1},{"$f":"IF(C991=0,\"\",COUNTIF($B$2:C991,1))","v":990},"Pomona State School"]
[457,"Pormpuraaw State School",{"$f":"IF(ISERROR(SEARCH(Workplace_Name,Workplace_Lookup!B992)),0,1)","v":1},{"$f":"IF(C992=0,\"\",COUNTIF($B$2:C992,1))","v":991},"Pormpuraaw State School"]
[208,"Port Curtis Road State School",{"$f":"IF(ISERROR(SEARCH(Workplace_Name,Workplace_Lookup!B993)),0,1)","v":1},{"$f":"IF(C993=0,\"\",COUNTIF($B$2:C993,1))","v":992},"Port Curtis Road State School"]
[1979,"Port Douglas State School",{"$f":"IF(ISERROR(SEARCH(Workplace_Name,Workplace_Lookup!B994)),0,1)","v":1},{"$f":"IF(C994=0,\"\",COUNTIF($B$2:C994,1))","v":993},"Port Douglas State School"]
[1704,"Pozieres State School",{"$f":"IF(ISERROR(SEARCH(Workplace_Name,Workplace_Lookup!B995)),0,1)","v":1},{"$f":"IF(C995=0,\"\",COUNTIF($B$2:C995,1))","v":994},"Pozieres State School"]
[488,"Prairie State School",{"$f":"IF(ISERROR(SEARCH(Workplace_Name,Workplace_Lookup!B996)),0,1)","v":1},{"$f":"IF(C996=0,\"\",COUNTIF($B$2:C996,1))","v":995},"Prairie State School"]
[238,"Prenzlau State School",{"$f":"IF(ISERROR(SEARCH(Workplace_Name,Workplace_Lookup!B997)),0,1)","v":1},{"$f":"IF(C997=0,\"\",COUNTIF($B$2:C997,1))","v":996},"Prenzlau State School"]
[2090,"Proserpine State High School",{"$f":"IF(ISERROR(SEARCH(Workplace_Name,Workplace_Lookup!B998)),0,1)","v":1},{"$f":"IF(C998=0,\"\",COUNTIF($B$2:C998,1))","v":997},"Proserpine State High School"]
[779,"Proserpine State School",{"$f":"IF(ISERROR(SEARCH(Workplace_Name,Workplace_Lookup!B999)),0,1)","v":1},{"$f":"IF(C999=0,\"\",COUNTIF($B$2:C999,1))","v":998},"Proserpine State School"]
[1655,"Prospect Creek State School",{"$f":"IF(ISERROR(SEARCH(Workplace_Name,Workplace_Lookup!B1000)),0,1)","v":1},{"$f":"IF(C1000=0,\"\",COUNTIF($B$2:C1000,1))","v":999},"Prospect Creek State School"]
[1155,"Proston State School",{"$f":"IF(ISERROR(SEARCH(Workplace_Name,Workplace_Lookup!B1001)),0,1)","v":1},{"$f":"IF(C1001=0,\"\",COUNTIF($B$2:C1001,1))","v":1000},"Proston State School"]
[3565,"Pullenvale Environmental Education Centre",{"$f":"IF(ISERROR(SEARCH(Workplace_Name,Workplace_Lookup!B1002)),0,1)","v":1},{"$f":"IF(C1002=0,\"\",COUNTIF($B$2:C1002,1))","v":1001},"Pullenvale Environmental Education Centre"]
[140,"Pullenvale State School",{"$f":"IF(ISERROR(SEARCH(Workplace_Name,Workplace_Lookup!B1003)),0,1)","v":1},{"$f":"IF(C1003=0,\"\",COUNTIF($B$2:C1003,1))","v":1002},"Pullenvale State School"]
[9324,"Pumicestone State School",{"$f":"IF(ISERROR(SEARCH(Workplace_Name,Workplace_Lookup!B1004)),0,1)","v":1},{"$f":"IF(C1004=0,\"\",COUNTIF($B$2:C1004,1))","v":1003},"Pumicestone State School"]
[3100,"QCHS - Royal Brisbane and ACT for Kids Campus",{"$f":"IF(ISERROR(SEARCH(Workplace_Name,Workplace_Lookup!B1005)),0,1)","v":1},{"$f":"IF(C1005=0,\"\",COUNTIF($B$2:C1005,1))","v":1004},"QCHS - Royal Brisbane and ACT for Kids Campus"]
[2275,"QRSS Peninsula Regional School Sport",{"$f":"IF(ISERROR(SEARCH(Workplace_Name,Workplace_Lookup!B1006)),0,1)","v":1},{"$f":"IF(C1006=0,\"\",COUNTIF($B$2:C1006,1))","v":1005},"QRSS Peninsula Regional School Sport"]
[1194,"Queens Beach State School",{"$f":"IF(ISERROR(SEARCH(Workplace_Name,Workplace_Lookup!B1007)),0,1)","v":1},{"$f":"IF(C1007=0,\"\",COUNTIF($B$2:C1007,1))","v":1006},"Queens Beach State School"]
[5685,"Queensland Academy for Creative Industries",{"$f":"IF(ISERROR(SEARCH(Workplace_Name,Workplace_Lookup!B1008)),0,1)","v":1},{"$f":"IF(C1008=0,\"\",COUNTIF($B$2:C1008,1))","v":1007},"Queensland Academy for Creative Industries"]
[5727,"Queensland Academy for Health Sciences",{"$f":"IF(ISERROR(SEARCH(Workplace_Name,Workplace_Lookup!B1009)),0,1)","v":1},{"$f":"IF(C1009=0,\"\",COUNTIF($B$2:C1009,1))","v":1008},"Queensland Academy for Health Sciences"]
[5684,"Queensland Academy for Science Mathematics and Technology",{"$f":"IF(ISERROR(SEARCH(Workplace_Name,Workplace_Lookup!B1010)),0,1)","v":1},{"$f":"IF(C1010=0,\"\",COUNTIF($B$2:C1010,1))","v":1009},"Queensland Academy for Science Mathematics and Technology"]
[3102,"Queensland Children's Hospital School",{"$f":"IF(ISERROR(SEARCH(Workplace_Name,Workplace_Lookup!B1011)),0,1)","v":1},{"$f":"IF(C1011=0,\"\",COUNTIF($B$2:C1011,1))","v":1010},"Queensland Children's Hospital School"]
[3036,"Queensland Pathways State College",{"$f":"IF(ISERROR(SEARCH(Workplace_Name,Workplace_Lookup!B1012)),0,1)","v":1},{"$f":"IF(C1012=0,\"\",COUNTIF($B$2:C1012,1))","v":1011},"Queensland Pathways State College"]
["A085","Queensland Pathways State College - Bracken Ridge Campus",{"$f":"IF(ISERROR(SEARCH(Workplace_Name,Workplace_Lookup!B1013)),0,1)","v":1},{"$f":"IF(C1013=0,\"\",COUNTIF($B$2:C1013,1))","v":1012},"Queensland Pathways State College - Bracken Ridge Campus"]
["A070","Queensland Pathways State College - Bundamba Campus",{"$f":"IF(ISERROR(SEARCH(Workplace_Name,Workplace_Lookup!B1014)),0,1)","v":1},{"$f":"IF(C1014=0,\"\",COUNTIF($B$2:C1014,1))","v":1013},"Queensland Pathways State College - Bundamba Campus"]
[9956,"Queensland Pathways State College - Goodna Campus",{"$f":"IF(ISERROR(SEARCH(Workplace_Name,Workplace_Lookup!B1015)),0,1)","v":1},{"$f":"IF(C1015=0,\"\",COUNTIF($B$2:C1015,1))","v":1014},"Queensland Pathways State College - Goodna Campus"]
["A653","Queensland Pathways State College - Inner City Campus",{"$f":"IF(ISERROR(SEARCH(Workplace_Name,Workplace_Lookup!B1016)),0,1)","v":1},{"$f":"IF(C1016=0,\"\",COUNTIF($B$2:C1016,1))","v":1015},"Queensland Pathways State College - Inner City Campus"]
[9199,"Queensland Pathways State College - Mt Gravatt Campus",{"$f":"IF(ISERROR(SEARCH(Workplace_Name,Workplace_Lookup!B1017)),0,1)","v":1},{"$f":"IF(C1017=0,\"\",COUNTIF($B$2:C1017,1))","v":1016},"Queensland Pathways State College - Mt Gravatt Campus"]
["A104","Queensland Pathways State College - Townsville Campus",{"$f":"IF(ISERROR(SEARCH(Workplace_Name,Workplace_Lookup!B1018)),0,1)","v":1},{"$f":"IF(C1018=0,\"\",COUNTIF($B$2:C1018,1))","v":1017},"Queensland Pathways State College - Townsville Campus"]
[1594,"Quilpie State College",{"$f":"IF(ISERROR(SEARCH(Workplace_Name,Workplace_Lookup!B1019)),0,1)","v":1},{"$f":"IF(C1019=0,\"\",COUNTIF($B$2:C1019,1))","v":1018},"Quilpie State College"]
[958,"Quinalow Prep-10 State School",{"$f":"IF(ISERROR(SEARCH(Workplace_Name,Workplace_Lookup!B1020)),0,1)","v":1},{"$f":"IF(C1020=0,\"\",COUNTIF($B$2:C1020,1))","v":1019},"Quinalow Prep-10 State School"]
[975,"Raceview State School",{"$f":"IF(ISERROR(SEARCH(Workplace_Name,Workplace_Lookup!B1021)),0,1)","v":1},{"$f":"IF(C1021=0,\"\",COUNTIF($B$2:C1021,1))","v":1020},"Raceview State School"]
[1530,"Railway Estate State School",{"$f":"IF(ISERROR(SEARCH(Workplace_Name,Workplace_Lookup!B1022)),0,1)","v":1},{"$f":"IF(C1022=0,\"\",COUNTIF($B$2:C1022,1))","v":1021},"Railway Estate State School"]
[1955,"Rainbow Beach State School",{"$f":"IF(ISERROR(SEARCH(Workplace_Name,Workplace_Lookup!B1023)),0,1)","v":1},{"$f":"IF(C1023=0,\"\",COUNTIF($B$2:C1023,1))","v":1022},"Rainbow Beach State School"]
[1491,"Rainworth State School",{"$f":"IF(ISERROR(SEARCH(Workplace_Name,Workplace_Lookup!B1024)),0,1)","v":1},{"$f":"IF(C1024=0,\"\",COUNTIF($B$2:C1024,1))","v":1023},"Rainworth State School"]
[29,"Ramsay State School",{"$f":"IF(ISERROR(SEARCH(Workplace_Name,Workplace_Lookup!B1025)),0,1)","v":1},{"$f":"IF(C1025=0,\"\",COUNTIF($B$2:C1025,1))","v":1024},"Ramsay State School"]
[1174,"Rangeville State School",{"$f":"IF(ISERROR(SEARCH(Workplace_Name,Workplace_Lookup!B1026)),0,1)","v":1},{"$f":"IF(C1026=0,\"\",COUNTIF($B$2:C1026,1))","v":1025},"Rangeville State School"]
[1870,"Rasmussen State School",{"$f":"IF(ISERROR(SEARCH(Workplace_Name,Workplace_Lookup!B1027)),0,1)","v":1},{"$f":"IF(C1027=0,\"\",COUNTIF($B$2:C1027,1))","v":1026},"Rasmussen State School"]
[1332,"Rathdowney State School",{"$f":"IF(ISERROR(SEARCH(Workplace_Name,Workplace_Lookup!B1028)),0,1)","v":1},{"$f":"IF(C1028=0,\"\",COUNTIF($B$2:C1028,1))","v":1027},{"$f":"IFERROR(INDEX(B:B,MATCH(ROW(B1027),D:D,0)),\"\")","v":"Rathdowney State School"}]
[6147,"Ravenshoe State School - Junior Campus",{"$f":"IF(ISERROR(SEARCH(Workplace_Name,Workplace_Lookup!B1029)),0,1)","v":1},{"$f":"IF(C1029=0,\"\",COUNTIF($B$2:C1029,1))","v":1028},"Ravenshoe State School - Junior Campus"]
[6148,"Ravenshoe State School - Senior Campus",{"$f":"IF(ISERROR(SEARCH(Workplace_Name,Workplace_Lookup!B1030)),0,1)","v":1},{"$f":"IF(C1030=0,\"\",COUNTIF($B$2:C1030,1))","v":1029},"Ravenshoe State School - Senior Campus"]
[141,"Ravenswood State School",{"$f":"IF(ISERROR(SEARCH(Workplace_Name,Workplace_Lookup!B1031)),0,1)","v":1},{"$f":"IF(C1031=0,\"\",COUNTIF($B$2:C1031,1))","v":1030},"Ravenswood State School"]
[3085,"Red Hill Special School",{"$f":"IF(ISERROR(SEARCH(Workplace_Name,Workplace_Lookup!B1032)),0,1)","v":1},{"$f":"IF(C1032=0,\"\",COUNTIF($B$2:C1032,1))","v":1031},"Red Hill Special School"]
["A652","Red Hill Special School - Ithaca Campus",{"$f":"IF(ISERROR(SEARCH(Workplace_Name,Workplace_Lookup!B1033)),0,1)","v":1},{"$f":"IF(C1033=0,\"\",COUNTIF($B$2:C1033,1))","v":1032},"Red Hill Special School - Ithaca Campus"]
[2174,"Redbank Plains State High School",{"$f":"IF(ISERROR(SEARCH(Workplace_Name,Workplace_Lookup!B1034)),0,1)","v":1},{"$f":"IF(C1034=0,\"\",COUNTIF($B$2:C1034,1))","v":1033},"Redbank Plains State High School"]
[88,"Redbank Plains State School",{"$f":"IF(ISERROR(SEARCH(Workplace_Name,Workplace_Lookup!B1035)),0,1)","v":1},{"$f":"IF(C1035=0,\"\",COUNTIF($B$2:C1035,1))","v":1034},"Redbank Plains State School"]
[719,"Redbank State School",{"$f":"IF(ISERROR(SEARCH(Workplace_Name,Workplace_Lookup!B1036)),0,1)","v":1},{"$f":"IF(C1036=0,\"\",COUNTIF($B$2:C1036,1))","v":1035},"Redbank State School"]
[3009,"Redcliffe Special School",{"$f":"IF(ISERROR(SEARCH(Workplace_Name,Workplace_Lookup!B1037)),0,1)","v":1},{"$f":"IF(C1037=0,\"\",COUNTIF($B$2:C1037,1))","v":1036},"Redcliffe Special School"]
[2045,"Redcliffe State High School",{"$f":"IF(ISERROR(SEARCH(Workplace_Name,Workplace_Lookup!B1038)),0,1)","v":1},{"$f":"IF(C1038=0,\"\",COUNTIF($B$2:C1038,1))","v":1037},"Redcliffe State High School"]
[229,"Redland Bay State School",{"$f":"IF(ISERROR(SEARCH(Workplace_Name,Workplace_Lookup!B1039)),0,1)","v":1},{"$f":"IF(C1039=0,\"\",COUNTIF($B$2:C1039,1))","v":1038},"Redland Bay State School"]
[3033,"Redland District Special School",{"$f":"IF(ISERROR(SEARCH(Workplace_Name,Workplace_Lookup!B1040)),0,1)","v":1},{"$f":"IF(C1040=0,\"\",COUNTIF($B$2:C1040,1))","v":1039},"Redland District Special School"]
[1336,"Redlynch State College",{"$f":"IF(ISERROR(SEARCH(Workplace_Name,Workplace_Lookup!B1041)),0,1)","v":1},{"$f":"IF(C1041=0,\"\",COUNTIF($B$2:C1041,1))","v":1040},"Redlynch State College"]
[1996,"Regents Park State School",{"$f":"IF(ISERROR(SEARCH(Workplace_Name,Workplace_Lookup!B1042)),0,1)","v":1},{"$f":"IF(C1042=0,\"\",COUNTIF($B$2:C1042,1))","v":1041},"Regents Park State School"]
[721,"Richlands East State School",{"$f":"IF(ISERROR(SEARCH(Workplace_Name,Workplace_Lookup!B1043)),0,1)","v":1},{"$f":"IF(C1043=0,\"\",COUNTIF($B$2:C1043,1))","v":1042},"Richlands East State School"]
[733,"Richmond Hill State School",{"$f":"IF(ISERROR(SEARCH(Workplace_Name,Workplace_Lookup!B1044)),0,1)","v":1},{"$f":"IF(C1044=0,\"\",COUNTIF($B$2:C1044,1))","v":1043},"Richmond Hill State School"]
[576,"Richmond State School",{"$f":"IF(ISERROR(SEARCH(Workplace_Name,Workplace_Lookup!B1045)),0,1)","v":1},{"$f":"IF(C1045=0,\"\",COUNTIF($B$2:C1045,1))","v":1044},"Richmond State School"]
[1489,"Ridgelands State School",{"$f":"IF(ISERROR(SEARCH(Workplace_Name,Workplace_Lookup!B1046)),0,1)","v":1},{"$f":"IF(C1046=0,\"\",COUNTIF($B$2:C1046,1))","v":1045},"Ridgelands State School"]
["B118","Ripley Central State School",{"$f":"IF(ISERROR(SEARCH(Workplace_Name,Workplace_Lookup!B1047)),0,1)","v":1},{"$f":"IF(C1047=0,\"\",COUNTIF($B$2:C1047,1))","v":1046},"Ripley Central State School"]
["A790","Ripley Valley State School",{"$f":"IF(ISERROR(SEARCH(Workplace_Name,Workplace_Lookup!B1048)),0,1)","v":1},{"$f":"IF(C1048=0,\"\",COUNTIF($B$2:C1048,1))","v":1047},"Ripley Valley State School"]
["A797","Ripley Valley State Secondary College",{"$f":"IF(ISERROR(SEARCH(Workplace_Name,Workplace_Lookup!B1049)),0,1)","v":1},{"$f":"IF(C1049=0,\"\",COUNTIF($B$2:C1049,1))","v":1048},"Ripley Valley State Secondary College"]
[1865,"Riverview State School",{"$f":"IF(ISERROR(SEARCH(Workplace_Name,Workplace_Lookup!B1050)),0,1)","v":1},{"$f":"IF(C1050=0,\"\",COUNTIF($B$2:C1050,1))","v":1049},"Riverview State School"]
[582,"Roadvale State School",{"$f":"IF(ISERROR(SEARCH(Workplace_Name,Workplace_Lookup!B1051)),0,1)","v":1},{"$f":"IF(C1051=0,\"\",COUNTIF($B$2:C1051,1))","v":1050},"Roadvale State School"]
[1899,"Robertson State School",{"$f":"IF(ISERROR(SEARCH(Workplace_Name,Workplace_Lookup!B1052)),0,1)","v":1},{"$f":"IF(C1052=0,\"\",COUNTIF($B$2:C1052,1))","v":1051},"Robertson State School"]
[195,"Robina State High School",{"$f":"IF(ISERROR(SEARCH(Workplace_Name,Workplace_Lookup!B1053)),0,1)","v":1},{"$f":"IF(C1053=0,\"\",COUNTIF($B$2:C1053,1))","v":1052},"Robina State High School"]
[1982,"Robina State School",{"$f":"IF(ISERROR(SEARCH(Workplace_Name,Workplace_Lookup!B1054)),0,1)","v":1},{"$f":"IF(C1054=0,\"\",COUNTIF($B$2:C1054,1))","v":1053},"Robina State School"]
[1886,"Rochedale South State School",{"$f":"IF(ISERROR(SEARCH(Workplace_Name,Workplace_Lookup!B1055)),0,1)","v":1},{"$f":"IF(C1055=0,\"\",COUNTIF($B$2:C1055,1))","v":1054},"Rochedale South State School"]
[2158,"Rochedale State High School",{"$f":"IF(ISERROR(SEARCH(Workplace_Name,Workplace_Lookup!B1056)),0,1)","v":1},{"$f":"IF(C1056=0,\"\",COUNTIF($B$2:C1056,1))","v":1055},"Rochedale State High School"]
[1638,"Rochedale State School",{"$f":"IF(ISERROR(SEARCH(Workplace_Name,Workplace_Lookup!B1057)),0,1)","v":1},{"$f":"IF(C1057=0,\"\",COUNTIF($B$2:C1057,1))","v":1056},"Rochedale State School"]
[3038,"Rockhampton North Special School",{"$f":"IF(ISERROR(SEARCH(Workplace_Name,Workplace_Lookup!B1058)),0,1)","v":1},{"$f":"IF(C1058=0,\"\",COUNTIF($B$2:C1058,1))","v":1057},"Rockhampton North Special School"]
[3010,"Rockhampton Special School",{"$f":"IF(ISERROR(SEARCH(Workplace_Name,Workplace_Lookup!B1059)),0,1)","v":1},{"$f":"IF(C1059=0,\"\",COUNTIF($B$2:C1059,1))","v":1058},"Rockhampton Special School"]
[2011,"Rockhampton State High School",{"$f":"IF(ISERROR(SEARCH(Workplace_Name,Workplace_Lookup!B1060)),0,1)","v":1},{"$f":"IF(C1060=0,\"\",COUNTIF($B$2:C1060,1))","v":1059},"Rockhampton State High School"]
[454,"Rocklea State School",{"$f":"IF(ISERROR(SEARCH(Workplace_Name,Workplace_Lookup!B1061)),0,1)","v":1},{"$f":"IF(C1061=0,\"\",COUNTIF($B$2:C1061,1))","v":1060},"Rocklea State School"]
[1786,"Rockville State School",{"$f":"IF(ISERROR(SEARCH(Workplace_Name,Workplace_Lookup!B1062)),0,1)","v":1},{"$f":"IF(C1062=0,\"\",COUNTIF($B$2:C1062,1))","v":1061},"Rockville State School"]
[92,"Rolleston State School",{"$f":"IF(ISERROR(SEARCH(Workplace_Name,Workplace_Lookup!B1063)),0,1)","v":1},{"$f":"IF(C1063=0,\"\",COUNTIF($B$2:C1063,1))","v":1062},"Rolleston State School"]
[1325,"Rollingstone State School",{"$f":"IF(ISERROR(SEARCH(Workplace_Name,Workplace_Lookup!B1064)),0,1)","v":1},{"$f":"IF(C1064=0,\"\",COUNTIF($B$2:C1064,1))","v":1063},"Rollingstone State School"]
[5666,"Roma State College",{"$f":"IF(ISERROR(SEARCH(Workplace_Name,Workplace_Lookup!B1065)),0,1)","v":1},{"$f":"IF(C1065=0,\"\",COUNTIF($B$2:C1065,1))","v":1064},"Roma State College"]
[613,"Ropeley State School",{"$f":"IF(ISERROR(SEARCH(Workplace_Name,Workplace_Lookup!B1066)),0,1)","v":1},{"$f":"IF(C1066=0,\"\",COUNTIF($B$2:C1066,1))","v":1065},"Ropeley State School"]
[759,"Rosedale State School",{"$f":"IF(ISERROR(SEARCH(Workplace_Name,Workplace_Lookup!B1067)),0,1)","v":1},{"$f":"IF(C1067=0,\"\",COUNTIF($B$2:C1067,1))","v":1066},"Rosedale State School"]
[3002,"Rosella Park School",{"$f":"IF(ISERROR(SEARCH(Workplace_Name,Workplace_Lookup!B1068)),0,1)","v":1},{"$f":"IF(C1068=0,\"\",COUNTIF($B$2:C1068,1))","v":1067},"Rosella Park School"]
[2151,"Rosewood State High School",{"$f":"IF(ISERROR(SEARCH(Workplace_Name,Workplace_Lookup!B1069)),0,1)","v":1},{"$f":"IF(C1069=0,\"\",COUNTIF($B$2:C1069,1))","v":1068},"Rosewood State High School"]
[131,"Rosewood State School",{"$f":"IF(ISERROR(SEARCH(Workplace_Name,Workplace_Lookup!B1070)),0,1)","v":1},{"$f":"IF(C1070=0,\"\",COUNTIF($B$2:C1070,1))","v":1069},"Rosewood State School"]
[1977,"Rossville State School",{"$f":"IF(ISERROR(SEARCH(Workplace_Name,Workplace_Lookup!B1071)),0,1)","v":1},{"$f":"IF(C1071=0,\"\",COUNTIF($B$2:C1071,1))","v":1070},"Rossville State School"]
[7192,"Runaway Bay Sport and Leadership Excellence Centre",{"$f":"IF(ISERROR(SEARCH(Workplace_Name,Workplace_Lookup!B1072)),0,1)","v":1},{"$f":"IF(C1072=0,\"\",COUNTIF($B$2:C1072,1))","v":1071},"Runaway Bay Sport and Leadership Excellence Centre"]
[472,"Runcorn Heights State School",{"$f":"IF(ISERROR(SEARCH(Workplace_Name,Workplace_Lookup!B1073)),0,1)","v":1},{"$f":"IF(C1073=0,\"\",COUNTIF($B$2:C1073,1))","v":1072},"Runcorn Heights State School"]
[2167,"Runcorn State High School",{"$f":"IF(ISERROR(SEARCH(Workplace_Name,Workplace_Lookup!B1074)),0,1)","v":1},{"$f":"IF(C1074=0,\"\",COUNTIF($B$2:C1074,1))","v":1073},"Runcorn State High School"]
[968,"Runcorn State School",{"$f":"IF(ISERROR(SEARCH(Workplace_Name,Workplace_Lookup!B1075)),0,1)","v":1},{"$f":"IF(C1075=0,\"\",COUNTIF($B$2:C1075,1))","v":1074},"Runcorn State School"]
[1488,"Russell Island State School",{"$f":"IF(ISERROR(SEARCH(Workplace_Name,Workplace_Lookup!B1076)),0,1)","v":1},{"$f":"IF(C1076=0,\"\",COUNTIF($B$2:C1076,1))","v":1075},"Russell Island State School"]
[1690,"Salisbury State School",{"$f":"IF(ISERROR(SEARCH(Workplace_Name,Workplace_Lookup!B1077)),0,1)","v":1},{"$f":"IF(C1077=0,\"\",COUNTIF($B$2:C1077,1))","v":1076},"Salisbury State School"]
[94,"Samford State School",{"$f":"IF(ISERROR(SEARCH(Workplace_Name,Workplace_Lookup!B1078)),0,1)","v":1},{"$f":"IF(C1078=0,\"\",COUNTIF($B$2:C1078,1))","v":1077},"Samford State School"]
[2047,"Sandgate District State High School",{"$f":"IF(ISERROR(SEARCH(Workplace_Name,Workplace_Lookup!B1079)),0,1)","v":1},{"$f":"IF(C1079=0,\"\",COUNTIF($B$2:C1079,1))","v":1078},"Sandgate District State High School"]
[153,"Sandgate State School",{"$f":"IF(ISERROR(SEARCH(Workplace_Name,Workplace_Lookup!B1080)),0,1)","v":1},{"$f":"IF(C1080=0,\"\",COUNTIF($B$2:C1080,1))","v":1079},"Sandgate State School"]
[1754,"Sandy Strait State School",{"$f":"IF(ISERROR(SEARCH(Workplace_Name,Workplace_Lookup!B1081)),0,1)","v":1},{"$f":"IF(C1081=0,\"\",COUNTIF($B$2:C1081,1))","v":1080},"Sandy Strait State School"]
[2101,"Sarina State High School",{"$f":"IF(ISERROR(SEARCH(Workplace_Name,Workplace_Lookup!B1082)),0,1)","v":1},{"$f":"IF(C1082=0,\"\",COUNTIF($B$2:C1082,1))","v":1081},"Sarina State High School"]
[546,"Sarina State School",{"$f":"IF(ISERROR(SEARCH(Workplace_Name,Workplace_Lookup!B1083)),0,1)","v":1},{"$f":"IF(C1083=0,\"\",COUNTIF($B$2:C1083,1))","v":1082},"Sarina State School"]
[1560,"Scarborough State School",{"$f":"IF(ISERROR(SEARCH(Workplace_Name,Workplace_Lookup!B1084)),0,1)","v":1},{"$f":"IF(C1084=0,\"\",COUNTIF($B$2:C1084,1))","v":1083},"Scarborough State School"]
["B261","Scenic Shores State School",{"$f":"IF(ISERROR(SEARCH(Workplace_Name,Workplace_Lookup!B1085)),0,1)","v":1},{"$f":"IF(C1085=0,\"\",COUNTIF($B$2:C1085,1))","v":1084},"Scenic Shores State School"]
[475,"Scottville State School",{"$f":"IF(ISERROR(SEARCH(Workplace_Name,Workplace_Lookup!B1086)),0,1)","v":1},{"$f":"IF(C1086=0,\"\",COUNTIF($B$2:C1086,1))","v":1085},"Scottville State School"]
[1479,"Seaforth State School",{"$f":"IF(ISERROR(SEARCH(Workplace_Name,Workplace_Lookup!B1087)),0,1)","v":1},{"$f":"IF(C1087=0,\"\",COUNTIF($B$2:C1087,1))","v":1086},"Seaforth State School"]
[590,"Serviceton South State School",{"$f":"IF(ISERROR(SEARCH(Workplace_Name,Workplace_Lookup!B1088)),0,1)","v":1},{"$f":"IF(C1088=0,\"\",COUNTIF($B$2:C1088,1))","v":1087},"Serviceton South State School"]
[1026,"Seven Hills State School",{"$f":"IF(ISERROR(SEARCH(Workplace_Name,Workplace_Lookup!B1089)),0,1)","v":1},{"$f":"IF(C1089=0,\"\",COUNTIF($B$2:C1089,1))","v":1088},"Seven Hills State School"]
[1007,"Severnlea State School",{"$f":"IF(ISERROR(SEARCH(Workplace_Name,Workplace_Lookup!B1090)),0,1)","v":1},{"$f":"IF(C1090=0,\"\",COUNTIF($B$2:C1090,1))","v":1089},"Severnlea State School"]
[1131,"Seville Road State School",{"$f":"IF(ISERROR(SEARCH(Workplace_Name,Workplace_Lookup!B1091)),0,1)","v":1},{"$f":"IF(C1091=0,\"\",COUNTIF($B$2:C1091,1))","v":1090},"Seville Road State School"]
[2149,"Shailer Park State High School",{"$f":"IF(ISERROR(SEARCH(Workplace_Name,Workplace_Lookup!B1092)),0,1)","v":1},{"$f":"IF(C1092=0,\"\",COUNTIF($B$2:C1092,1))","v":1091},{"$f":"IFERROR(INDEX(B:B,MATCH(ROW(B1091),D:D,0)),\"\")","v":"Shailer Park State High School"}]
[1916,"Shailer Park State School",{"$f":"IF(ISERROR(SEARCH(Workplace_Name,Workplace_Lookup!B1093)),0,1)","v":1},{"$f":"IF(C1093=0,\"\",COUNTIF($B$2:C1093,1))","v":1092},"Shailer Park State School"]
[400,"Sharon State School",{"$f":"IF(ISERROR(SEARCH(Workplace_Name,Workplace_Lookup!B1094)),0,1)","v":1},{"$f":"IF(C1094=0,\"\",COUNTIF($B$2:C1094,1))","v":1093},"Sharon State School"]
[78,"Sherwood State School",{"$f":"IF(ISERROR(SEARCH(Workplace_Name,Workplace_Lookup!B1095)),0,1)","v":1},{"$f":"IF(C1095=0,\"\",COUNTIF($B$2:C1095,1))","v":1094},"Sherwood State School"]
[1623,"Shorncliffe State School",{"$f":"IF(ISERROR(SEARCH(Workplace_Name,Workplace_Lookup!B1096)),0,1)","v":1},{"$f":"IF(C1096=0,\"\",COUNTIF($B$2:C1096,1))","v":1095},"Shorncliffe State School"]
[247,"Silkstone State School",{"$f":"IF(ISERROR(SEARCH(Workplace_Name,Workplace_Lookup!B1097)),0,1)","v":1},{"$f":"IF(C1097=0,\"\",COUNTIF($B$2:C1097,1))","v":1096},"Silkstone State School"]
[1528,"Silkwood State School",{"$f":"IF(ISERROR(SEARCH(Workplace_Name,Workplace_Lookup!B1098)),0,1)","v":1},{"$f":"IF(C1098=0,\"\",COUNTIF($B$2:C1098,1))","v":1097},"Silkwood State School"]
[1853,"Slade Point State School",{"$f":"IF(ISERROR(SEARCH(Workplace_Name,Workplace_Lookup!B1099)),0,1)","v":1},{"$f":"IF(C1099=0,\"\",COUNTIF($B$2:C1099,1))","v":1098},"Slade Point State School"]
[692,"Somerset Hills State School",{"$f":"IF(ISERROR(SEARCH(Workplace_Name,Workplace_Lookup!B1100)),0,1)","v":1},{"$f":"IF(C1100=0,\"\",COUNTIF($B$2:C1100,1))","v":1099},"Somerset Hills State School"]
[6620,"South East Region - Hope Island Office",{"$f":"IF(ISERROR(SEARCH(Workplace_Name,Workplace_Lookup!B1101)),0,1)","v":1},{"$f":"IF(C1101=0,\"\",COUNTIF($B$2:C1101,1))","v":1100},"South East Region - Hope Island Office"]
[1518,"South Johnstone State School",{"$f":"IF(ISERROR(SEARCH(Workplace_Name,Workplace_Lookup!B1102)),0,1)","v":1},{"$f":"IF(C1102=0,\"\",COUNTIF($B$2:C1102,1))","v":1101},"South Johnstone State School"]
["B119","South Rock State School",{"$f":"IF(ISERROR(SEARCH(Workplace_Name,Workplace_Lookup!B1103)),0,1)","v":1},{"$f":"IF(C1103=0,\"\",COUNTIF($B$2:C1103,1))","v":1102},"South Rock State School"]
[1241,"Southbrook Central State School",{"$f":"IF(ISERROR(SEARCH(Workplace_Name,Workplace_Lookup!B1104)),0,1)","v":1},{"$f":"IF(C1104=0,\"\",COUNTIF($B$2:C1104,1))","v":1103},"Southbrook Central State School"]
[1826,"Southport Campus",{"$f":"IF(ISERROR(SEARCH(Workplace_Name,Workplace_Lookup!B1105)),0,1)","v":1},{"$f":"IF(C1105=0,\"\",COUNTIF($B$2:C1105,1))","v":1104},"Southport Campus"]
[3026,"Southport Special School",{"$f":"IF(ISERROR(SEARCH(Workplace_Name,Workplace_Lookup!B1106)),0,1)","v":1},{"$f":"IF(C1106=0,\"\",COUNTIF($B$2:C1106,1))","v":1105},"Southport Special School"]
[2037,"Southport State High School",{"$f":"IF(ISERROR(SEARCH(Workplace_Name,Workplace_Lookup!B1107)),0,1)","v":1},{"$f":"IF(C1107=0,\"\",COUNTIF($B$2:C1107,1))","v":1106},"Southport State High School"]
[368,"Southport State School",{"$f":"IF(ISERROR(SEARCH(Workplace_Name,Workplace_Lookup!B1108)),0,1)","v":1},{"$f":"IF(C1108=0,\"\",COUNTIF($B$2:C1108,1))","v":1107},"Southport State School"]
[5149,"Spinifex State College - Mount Isa - Junior Campus",{"$f":"IF(ISERROR(SEARCH(Workplace_Name,Workplace_Lookup!B1109)),0,1)","v":1},{"$f":"IF(C1109=0,\"\",COUNTIF($B$2:C1109,1))","v":1108},"Spinifex State College - Mount Isa - Junior Campus"]
[5148,"Spinifex State College - Mount Isa - Senior Campus",{"$f":"IF(ISERROR(SEARCH(Workplace_Name,Workplace_Lookup!B1110)),0,1)","v":1},{"$f":"IF(C1110=0,\"\",COUNTIF($B$2:C1110,1))","v":1109},"Spinifex State College - Mount Isa - Senior Campus"]
[5151,"Spinifex State College - Mount Isa - Student Residential",{"$f":"IF(ISERROR(SEARCH(Workplace_Name,Workplace_Lookup!B1111)),0,1)","v":1},{"$f":"IF(C1111=0,\"\",COUNTIF($B$2:C1111,1))","v":1110},"Spinifex State College - Mount Isa - Student Residential"]
[5147,"Spinifex State College - Mount Isa Education and Training Precinct",{"$f":"IF(ISERROR(SEARCH(Workplace_Name,Workplace_Lookup!B1112)),0,1)","v":1},{"$f":"IF(C1112=0,\"\",COUNTIF($B$2:C1112,1))","v":1111},"Spinifex State College - Mount Isa Education and Training Precinct"]
["A657","Spring Mountain State School",{"$f":"IF(ISERROR(SEARCH(Workplace_Name,Workplace_Lookup!B1113)),0,1)","v":1},{"$f":"IF(C1113=0,\"\",COUNTIF($B$2:C1113,1))","v":1112},"Spring Mountain State School"]
[1931,"Springbrook State School",{"$f":"IF(ISERROR(SEARCH(Workplace_Name,Workplace_Lookup!B1114)),0,1)","v":1},{"$f":"IF(C1114=0,\"\",COUNTIF($B$2:C1114,1))","v":1113},"Springbrook State School"]
[7131,"Springfield Central State High School",{"$f":"IF(ISERROR(SEARCH(Workplace_Name,Workplace_Lookup!B1115)),0,1)","v":1},{"$f":"IF(C1115=0,\"\",COUNTIF($B$2:C1115,1))","v":1114},"Springfield Central State High School"]
[7123,"Springfield Central State School",{"$f":"IF(ISERROR(SEARCH(Workplace_Name,Workplace_Lookup!B1116)),0,1)","v":1},{"$f":"IF(C1116=0,\"\",COUNTIF($B$2:C1116,1))","v":1115},"Springfield Central State School"]
[5556,"Springfield Lakes State School",{"$f":"IF(ISERROR(SEARCH(Workplace_Name,Workplace_Lookup!B1117)),0,1)","v":1},{"$f":"IF(C1117=0,\"\",COUNTIF($B$2:C1117,1))","v":1116},"Springfield Lakes State School"]
[102,"Springsure State School",{"$f":"IF(ISERROR(SEARCH(Workplace_Name,Workplace_Lookup!B1118)),0,1)","v":1},{"$f":"IF(C1118=0,\"\",COUNTIF($B$2:C1118,1))","v":1117},"Springsure State School"]
[1869,"Springwood Central State School",{"$f":"IF(ISERROR(SEARCH(Workplace_Name,Workplace_Lookup!B1119)),0,1)","v":1},{"$f":"IF(C1119=0,\"\",COUNTIF($B$2:C1119,1))","v":1118},"Springwood Central State School"]
[358,"Springwood Road State School",{"$f":"IF(ISERROR(SEARCH(Workplace_Name,Workplace_Lookup!B1120)),0,1)","v":1},{"$f":"IF(C1120=0,\"\",COUNTIF($B$2:C1120,1))","v":1119},"Springwood Road State School"]
[2140,"Springwood State High School",{"$f":"IF(ISERROR(SEARCH(Workplace_Name,Workplace_Lookup!B1121)),0,1)","v":1},{"$f":"IF(C1121=0,\"\",COUNTIF($B$2:C1121,1))","v":1120},"Springwood State High School"]
[1425,"St Bernard State School",{"$f":"IF(ISERROR(SEARCH(Workplace_Name,Workplace_Lookup!B1122)),0,1)","v":1},{"$f":"IF(C1122=0,\"\",COUNTIF($B$2:C1122,1))","v":1121},"St Bernard State School"]
[2143,"St George State High School",{"$f":"IF(ISERROR(SEARCH(Workplace_Name,Workplace_Lookup!B1123)),0,1)","v":1},{"$f":"IF(C1123=0,\"\",COUNTIF($B$2:C1123,1))","v":1122},"St George State High School"]
[134,"St George State School",{"$f":"IF(ISERROR(SEARCH(Workplace_Name,Workplace_Lookup!B1124)),0,1)","v":1},{"$f":"IF(C1124=0,\"\",COUNTIF($B$2:C1124,1))","v":1123},"St George State School"]
[236,"St Helens State School",{"$f":"IF(ISERROR(SEARCH(Workplace_Name,Workplace_Lookup!B1125)),0,1)","v":1},{"$f":"IF(C1125=0,\"\",COUNTIF($B$2:C1125,1))","v":1124},"St Helens State School"]
[103,"St Lawrence State School",{"$f":"IF(ISERROR(SEARCH(Workplace_Name,Workplace_Lookup!B1126)),0,1)","v":1},{"$f":"IF(C1126=0,\"\",COUNTIF($B$2:C1126,1))","v":1125},"St Lawrence State School"]
[1016,"Stafford Heights State School",{"$f":"IF(ISERROR(SEARCH(Workplace_Name,Workplace_Lookup!B1127)),0,1)","v":1},{"$f":"IF(C1127=0,\"\",COUNTIF($B$2:C1127,1))","v":1126},"Stafford Heights State School"]
[487,"Stafford State School",{"$f":"IF(ISERROR(SEARCH(Workplace_Name,Workplace_Lookup!B1128)),0,1)","v":1},{"$f":"IF(C1128=0,\"\",COUNTIF($B$2:C1128,1))","v":1127},"Stafford State School"]
[3551,"Stanley River Environmental Education Centre",{"$f":"IF(ISERROR(SEARCH(Workplace_Name,Workplace_Lookup!B1129)),0,1)","v":1},{"$f":"IF(C1129=0,\"\",COUNTIF($B$2:C1129,1))","v":1128},"Stanley River Environmental Education Centre"]
[2064,"Stanthorpe State High School",{"$f":"IF(ISERROR(SEARCH(Workplace_Name,Workplace_Lookup!B1130)),0,1)","v":1},{"$f":"IF(C1130=0,\"\",COUNTIF($B$2:C1130,1))","v":1129},"Stanthorpe State High School"]
[132,"Stanthorpe State School",{"$f":"IF(ISERROR(SEARCH(Workplace_Name,Workplace_Lookup!B1131)),0,1)","v":1},{"$f":"IF(C1131=0,\"\",COUNTIF($B$2:C1131,1))","v":1130},"Stanthorpe State School"]
[129,"Stanwell State School",{"$f":"IF(ISERROR(SEARCH(Workplace_Name,Workplace_Lookup!B1132)),0,1)","v":1},{"$f":"IF(C1132=0,\"\",COUNTIF($B$2:C1132,1))","v":1131},"Stanwell State School"]
[933,"Stonehenge State School",{"$f":"IF(ISERROR(SEARCH(Workplace_Name,Workplace_Lookup!B1133)),0,1)","v":1},{"$f":"IF(C1133=0,\"\",COUNTIF($B$2:C1133,1))","v":1132},"Stonehenge State School"]
[1245,"Strathpine State School",{"$f":"IF(ISERROR(SEARCH(Workplace_Name,Workplace_Lookup!B1134)),0,1)","v":1},{"$f":"IF(C1134=0,\"\",COUNTIF($B$2:C1134,1))","v":1133},"Strathpine State School"]
[1910,"Strathpine West State School",{"$f":"IF(ISERROR(SEARCH(Workplace_Name,Workplace_Lookup!B1135)),0,1)","v":1},{"$f":"IF(C1135=0,\"\",COUNTIF($B$2:C1135,1))","v":1134},"Strathpine West State School"]
[5554,"Stretton State College",{"$f":"IF(ISERROR(SEARCH(Workplace_Name,Workplace_Lookup!B1136)),0,1)","v":1},{"$f":"IF(C1136=0,\"\",COUNTIF($B$2:C1136,1))","v":1135},"Stretton State College"]
[622,"Sunbury State School",{"$f":"IF(ISERROR(SEARCH(Workplace_Name,Workplace_Lookup!B1137)),0,1)","v":1},{"$f":"IF(C1137=0,\"\",COUNTIF($B$2:C1137,1))","v":1136},"Sunbury State School"]
[1889,"Sunnybank Hills State School",{"$f":"IF(ISERROR(SEARCH(Workplace_Name,Workplace_Lookup!B1138)),0,1)","v":1},{"$f":"IF(C1138=0,\"\",COUNTIF($B$2:C1138,1))","v":1137},"Sunnybank Hills State School"]
[3078,"Sunnybank Special School",{"$f":"IF(ISERROR(SEARCH(Workplace_Name,Workplace_Lookup!B1139)),0,1)","v":1},{"$f":"IF(C1139=0,\"\",COUNTIF($B$2:C1139,1))","v":1138},"Sunnybank Special School"]
[2080,"Sunnybank State High School",{"$f":"IF(ISERROR(SEARCH(Workplace_Name,Workplace_Lookup!B1140)),0,1)","v":1},{"$f":"IF(C1140=0,\"\",COUNTIF($B$2:C1140,1))","v":1139},"Sunnybank State High School"]
[62,"Sunnybank State School",{"$f":"IF(ISERROR(SEARCH(Workplace_Name,Workplace_Lookup!B1141)),0,1)","v":1},{"$f":"IF(C1141=0,\"\",COUNTIF($B$2:C1141,1))","v":1140},"Sunnybank State School"]
[965,"Sunset State School",{"$f":"IF(ISERROR(SEARCH(Workplace_Name,Workplace_Lookup!B1142)),0,1)","v":1},{"$f":"IF(C1142=0,\"\",COUNTIF($B$2:C1142,1))","v":1141},"Sunset State School"]
[2108,"Sunshine Beach State High School",{"$f":"IF(ISERROR(SEARCH(Workplace_Name,Workplace_Lookup!B1143)),0,1)","v":1},{"$f":"IF(C1143=0,\"\",COUNTIF($B$2:C1143,1))","v":1142},"Sunshine Beach State High School"]
[1917,"Sunshine Beach State School",{"$f":"IF(ISERROR(SEARCH(Workplace_Name,Workplace_Lookup!B1144)),0,1)","v":1},{"$f":"IF(C1144=0,\"\",COUNTIF($B$2:C1144,1))","v":1143},"Sunshine Beach State School"]
[3580,"Sunshine Coast Environmental Education Centre",{"$f":"IF(ISERROR(SEARCH(Workplace_Name,Workplace_Lookup!B1145)),0,1)","v":1},{"$f":"IF(C1145=0,\"\",COUNTIF($B$2:C1145,1))","v":1144},"Sunshine Coast Environmental Education Centre"]
[5488,"Sunshine Coast International Student Centre",{"$f":"IF(ISERROR(SEARCH(Workplace_Name,Workplace_Lookup!B1146)),0,1)","v":1},{"$f":"IF(C1146=0,\"\",COUNTIF($B$2:C1146,1))","v":1145},"Sunshine Coast International Student Centre"]
[142,"Surat State School",{"$f":"IF(ISERROR(SEARCH(Workplace_Name,Workplace_Lookup!B1147)),0,1)","v":1},{"$f":"IF(C1147=0,\"\",COUNTIF($B$2:C1147,1))","v":1146},"Surat State School"]
[1295,"Surfers Paradise State School",{"$f":"IF(ISERROR(SEARCH(Workplace_Name,Workplace_Lookup!B1148)),0,1)","v":1},{"$f":"IF(C1148=0,\"\",COUNTIF($B$2:C1148,1))","v":1147},"Surfers Paradise State School"]
[1595,"Swayneville State School",{"$f":"IF(ISERROR(SEARCH(Workplace_Name,Workplace_Lookup!B1149)),0,1)","v":1},{"$f":"IF(C1149=0,\"\",COUNTIF($B$2:C1149,1))","v":1148},"Swayneville State School"]
[1096,"Taabinga State School",{"$f":"IF(ISERROR(SEARCH(Workplace_Name,Workplace_Lookup!B1150)),0,1)","v":1},{"$f":"IF(C1150=0,\"\",COUNTIF($B$2:C1150,1))","v":1149},"Taabinga State School"]
[5726,"Tagai State College",{"$f":"IF(ISERROR(SEARCH(Workplace_Name,Workplace_Lookup!B1151)),0,1)","v":1},{"$f":"IF(C1151=0,\"\",COUNTIF($B$2:C1151,1))","v":1150},"Tagai State College"]
[1940,"Tagai State College - Badu Island Campus",{"$f":"IF(ISERROR(SEARCH(Workplace_Name,Workplace_Lookup!B1152)),0,1)","v":1},{"$f":"IF(C1152=0,\"\",COUNTIF($B$2:C1152,1))","v":1151},"Tagai State College - Badu Island Campus"]
[1944,"Tagai State College - Darnley Island Campus",{"$f":"IF(ISERROR(SEARCH(Workplace_Name,Workplace_Lookup!B1153)),0,1)","v":1},{"$f":"IF(C1153=0,\"\",COUNTIF($B$2:C1153,1))","v":1152},"Tagai State College - Darnley Island Campus"]
[1950,"Tagai State College - Dauan Island Campus",{"$f":"IF(ISERROR(SEARCH(Workplace_Name,Workplace_Lookup!B1154)),0,1)","v":1},{"$f":"IF(C1154=0,\"\",COUNTIF($B$2:C1154,1))","v":1153},"Tagai State College - Dauan Island Campus"]
[1995,"Tagai State College - Horn Island Campus",{"$f":"IF(ISERROR(SEARCH(Workplace_Name,Workplace_Lookup!B1155)),0,1)","v":1},{"$f":"IF(C1155=0,\"\",COUNTIF($B$2:C1155,1))","v":1154},"Tagai State College - Horn Island Campus"]
[1949,"Tagai State College - Kubin Campus",{"$f":"IF(ISERROR(SEARCH(Workplace_Name,Workplace_Lookup!B1156)),0,1)","v":1},{"$f":"IF(C1156=0,\"\",COUNTIF($B$2:C1156,1))","v":1155},{"$f":"IFERROR(INDEX(B:B,MATCH(ROW(B1155),D:D,0)),\"\")","v":"Tagai State College - Kubin Campus"}]
[1942,"Tagai State College - Mabuiag Island Campus",{"$f":"IF(ISERROR(SEARCH(Workplace_Name,Workplace_Lookup!B1157)),0,1)","v":1},{"$f":"IF(C1157=0,\"\",COUNTIF($B$2:C1157,1))","v":1156},"Tagai State College - Mabuiag Island Campus"]
[1941,"Tagai State College - Malu Kiwai Campus",{"$f":"IF(ISERROR(SEARCH(Workplace_Name,Workplace_Lookup!B1158)),0,1)","v":1},{"$f":"IF(C1158=0,\"\",COUNTIF($B$2:C1158,1))","v":1157},"Tagai State College - Malu Kiwai Campus"]
[1943,"Tagai State College - Mer Campus",{"$f":"IF(ISERROR(SEARCH(Workplace_Name,Workplace_Lookup!B1159)),0,1)","v":1},{"$f":"IF(C1159=0,\"\",COUNTIF($B$2:C1159,1))","v":1158},"Tagai State College - Mer Campus"]
[1951,"Tagai State College - Poruma Campus",{"$f":"IF(ISERROR(SEARCH(Workplace_Name,Workplace_Lookup!B1160)),0,1)","v":1},{"$f":"IF(C1160=0,\"\",COUNTIF($B$2:C1160,1))","v":1159},"Tagai State College - Poruma Campus"]
[1946,"Tagai State College - Saibai Island Campus",{"$f":"IF(ISERROR(SEARCH(Workplace_Name,Workplace_Lookup!B1161)),0,1)","v":1},{"$f":"IF(C1161=0,\"\",COUNTIF($B$2:C1161,1))","v":1160},"Tagai State College - Saibai Island Campus"]
[1953,"Tagai State College - St Pauls Campus",{"$f":"IF(ISERROR(SEARCH(Workplace_Name,Workplace_Lookup!B1162)),0,1)","v":1},{"$f":"IF(C1162=0,\"\",COUNTIF($B$2:C1162,1))","v":1161},"Tagai State College - St Pauls Campus"]
[1952,"Tagai State College - Stephen Island Campus",{"$f":"IF(ISERROR(SEARCH(Workplace_Name,Workplace_Lookup!B1163)),0,1)","v":1},{"$f":"IF(C1163=0,\"\",COUNTIF($B$2:C1163,1))","v":1162},"Tagai State College - Stephen Island Campus"]
[463,"Tagai State College - Thursday Island Primary Campus",{"$f":"IF(ISERROR(SEARCH(Workplace_Name,Workplace_Lookup!B1164)),0,1)","v":1},{"$f":"IF(C1164=0,\"\",COUNTIF($B$2:C1164,1))","v":1163},"Tagai State College - Thursday Island Primary Campus"]
[2114,"Tagai State College - Thursday Island Secondary",{"$f":"IF(ISERROR(SEARCH(Workplace_Name,Workplace_Lookup!B1165)),0,1)","v":1},{"$f":"IF(C1165=0,\"\",COUNTIF($B$2:C1165,1))","v":1164},"Tagai State College - Thursday Island Secondary"]
[1948,"Tagai State College - Warraber Island Campus",{"$f":"IF(ISERROR(SEARCH(Workplace_Name,Workplace_Lookup!B1166)),0,1)","v":1},{"$f":"IF(C1166=0,\"\",COUNTIF($B$2:C1166,1))","v":1165},"Tagai State College - Warraber Island Campus"]
[1947,"Tagai State College - Yam Island Campus",{"$f":"IF(ISERROR(SEARCH(Workplace_Name,Workplace_Lookup!B1167)),0,1)","v":1},{"$f":"IF(C1167=0,\"\",COUNTIF($B$2:C1167,1))","v":1166},"Tagai State College - Yam Island Campus"]
[1945,"Tagai State College - Yorke Island Campus",{"$f":"IF(ISERROR(SEARCH(Workplace_Name,Workplace_Lookup!B1168)),0,1)","v":1},{"$f":"IF(C1168=0,\"\",COUNTIF($B$2:C1168,1))","v":1167},"Tagai State College - Yorke Island Campus"]
[1112,"Taigum State School",{"$f":"IF(ISERROR(SEARCH(Workplace_Name,Workplace_Lookup!B1169)),0,1)","v":1},{"$f":"IF(C1169=0,\"\",COUNTIF($B$2:C1169,1))","v":1168},"Taigum State School"]
[462,"Talara Primary College",{"$f":"IF(ISERROR(SEARCH(Workplace_Name,Workplace_Lookup!B1170)),0,1)","v":1},{"$f":"IF(C1170=0,\"\",COUNTIF($B$2:C1170,1))","v":1169},"Talara Primary College"]
[3555,"Tallebudgera Outdoor and Environmental Education Centre",{"$f":"IF(ISERROR(SEARCH(Workplace_Name,Workplace_Lookup!B1171)),0,1)","v":1},{"$f":"IF(C1171=0,\"\",COUNTIF($B$2:C1171,1))","v":1170},"Tallebudgera Outdoor and Environmental Education Centre"]
[201,"Tallebudgera State School",{"$f":"IF(ISERROR(SEARCH(Workplace_Name,Workplace_Lookup!B1172)),0,1)","v":1},{"$f":"IF(C1172=0,\"\",COUNTIF($B$2:C1172,1))","v":1171},"Tallebudgera State School"]
[1615,"Talwood State School",{"$f":"IF(ISERROR(SEARCH(Workplace_Name,Workplace_Lookup!B1173)),0,1)","v":1},{"$f":"IF(C1173=0,\"\",COUNTIF($B$2:C1173,1))","v":1172},"Talwood State School"]
[150,"Tambo State School",{"$f":"IF(ISERROR(SEARCH(Workplace_Name,Workplace_Lookup!B1174)),0,1)","v":1},{"$f":"IF(C1174=0,\"\",COUNTIF($B$2:C1174,1))","v":1173},"Tambo State School"]
[2265,"Tamborine Mountain State High School",{"$f":"IF(ISERROR(SEARCH(Workplace_Name,Workplace_Lookup!B1175)),0,1)","v":1},{"$f":"IF(C1175=0,\"\",COUNTIF($B$2:C1175,1))","v":1174},"Tamborine Mountain State High School"]
[913,"Tamborine Mountain State School",{"$f":"IF(ISERROR(SEARCH(Workplace_Name,Workplace_Lookup!B1176)),0,1)","v":1},{"$f":"IF(C1176=0,\"\",COUNTIF($B$2:C1176,1))","v":1175},"Tamborine Mountain State School"]
[1252,"Tamrookum State School",{"$f":"IF(ISERROR(SEARCH(Workplace_Name,Workplace_Lookup!B1177)),0,1)","v":1},{"$f":"IF(C1177=0,\"\",COUNTIF($B$2:C1177,1))","v":1176},"Tamrookum State School"]
[1446,"Tanduringie State School",{"$f":"IF(ISERROR(SEARCH(Workplace_Name,Workplace_Lookup!B1178)),0,1)","v":1},{"$f":"IF(C1178=0,\"\",COUNTIF($B$2:C1178,1))","v":1177},"Tanduringie State School"]
[231,"Tannum Sands State High School",{"$f":"IF(ISERROR(SEARCH(Workplace_Name,Workplace_Lookup!B1179)),0,1)","v":1},{"$f":"IF(C1179=0,\"\",COUNTIF($B$2:C1179,1))","v":1178},"Tannum Sands State High School"]
[1921,"Tannum Sands State School",{"$f":"IF(ISERROR(SEARCH(Workplace_Name,Workplace_Lookup!B1180)),0,1)","v":1},{"$f":"IF(C1180=0,\"\",COUNTIF($B$2:C1180,1))","v":1179},"Tannum Sands State School"]
[1357,"Tara Shire State College",{"$f":"IF(ISERROR(SEARCH(Workplace_Name,Workplace_Lookup!B1181)),0,1)","v":1},{"$f":"IF(C1181=0,\"\",COUNTIF($B$2:C1181,1))","v":1180},"Tara Shire State College"]
[271,"Tarampa State School",{"$f":"IF(ISERROR(SEARCH(Workplace_Name,Workplace_Lookup!B1182)),0,1)","v":1},{"$f":"IF(C1182=0,\"\",COUNTIF($B$2:C1182,1))","v":1181},"Tarampa State School"]
[1992,"Taranganba State School",{"$f":"IF(ISERROR(SEARCH(Workplace_Name,Workplace_Lookup!B1183)),0,1)","v":1},{"$f":"IF(C1183=0,\"\",COUNTIF($B$2:C1183,1))","v":1182},"Taranganba State School"]
[105,"Taroom State School",{"$f":"IF(ISERROR(SEARCH(Workplace_Name,Workplace_Lookup!B1184)),0,1)","v":1},{"$f":"IF(C1184=0,\"\",COUNTIF($B$2:C1184,1))","v":1183},"Taroom State School"]
[494,"Teelba State School",{"$f":"IF(ISERROR(SEARCH(Workplace_Name,Workplace_Lookup!B1185)),0,1)","v":1},{"$f":"IF(C1185=0,\"\",COUNTIF($B$2:C1185,1))","v":1184},"Teelba State School"]
[106,"Tent Hill Lower State School",{"$f":"IF(ISERROR(SEARCH(Workplace_Name,Workplace_Lookup!B1186)),0,1)","v":1},{"$f":"IF(C1186=0,\"\",COUNTIF($B$2:C1186,1))","v":1185},"Tent Hill Lower State School"]
[181,"Tewantin State School",{"$f":"IF(ISERROR(SEARCH(Workplace_Name,Workplace_Lookup!B1187)),0,1)","v":1},{"$f":"IF(C1187=0,\"\",COUNTIF($B$2:C1187,1))","v":1186},"Tewantin State School"]
[437,"Texas P-10 State School",{"$f":"IF(ISERROR(SEARCH(Workplace_Name,Workplace_Lookup!B1188)),0,1)","v":1},{"$f":"IF(C1188=0,\"\",COUNTIF($B$2:C1188,1))","v":1187},"Texas P-10 State School"]
[1573,"Thabeban State School",{"$f":"IF(ISERROR(SEARCH(Workplace_Name,Workplace_Lookup!B1189)),0,1)","v":1},{"$f":"IF(C1189=0,\"\",COUNTIF($B$2:C1189,1))","v":1188},"Thabeban State School"]
[1278,"Thallon State School",{"$f":"IF(ISERROR(SEARCH(Workplace_Name,Workplace_Lookup!B1190)),0,1)","v":1},{"$f":"IF(C1190=0,\"\",COUNTIF($B$2:C1190,1))","v":1189},"Thallon State School"]
[1840,"Thangool State School",{"$f":"IF(ISERROR(SEARCH(Workplace_Name,Workplace_Lookup!B1191)),0,1)","v":1},{"$f":"IF(C1191=0,\"\",COUNTIF($B$2:C1191,1))","v":1190},"Thangool State School"]
[409,"Thargomindah State School",{"$f":"IF(ISERROR(SEARCH(Workplace_Name,Workplace_Lookup!B1192)),0,1)","v":1},{"$f":"IF(C1192=0,\"\",COUNTIF($B$2:C1192,1))","v":1191},"Thargomindah State School"]
[1018,"The Caves State School",{"$f":"IF(ISERROR(SEARCH(Workplace_Name,Workplace_Lookup!B1193)),0,1)","v":1},{"$f":"IF(C1193=0,\"\",COUNTIF($B$2:C1193,1))","v":1192},"The Caves State School"]
[2053,"The Gap State High School",{"$f":"IF(ISERROR(SEARCH(Workplace_Name,Workplace_Lookup!B1194)),0,1)","v":1},{"$f":"IF(C1194=0,\"\",COUNTIF($B$2:C1194,1))","v":1193},"The Gap State High School"]
[1302,"The Gap State School",{"$f":"IF(ISERROR(SEARCH(Workplace_Name,Workplace_Lookup!B1195)),0,1)","v":1},{"$f":"IF(C1195=0,\"\",COUNTIF($B$2:C1195,1))","v":1194},"The Gap State School"]
[1360,"The Gums State School",{"$f":"IF(ISERROR(SEARCH(Workplace_Name,Workplace_Lookup!B1196)),0,1)","v":1},{"$f":"IF(C1196=0,\"\",COUNTIF($B$2:C1196,1))","v":1195},"The Gums State School"]
[1195,"The Hall State School",{"$f":"IF(ISERROR(SEARCH(Workplace_Name,Workplace_Lookup!B1197)),0,1)","v":1},{"$f":"IF(C1197=0,\"\",COUNTIF($B$2:C1197,1))","v":1196},"The Hall State School"]
[1714,"The Summit State School",{"$f":"IF(ISERROR(SEARCH(Workplace_Name,Workplace_Lookup!B1198)),0,1)","v":1},{"$f":"IF(C1198=0,\"\",COUNTIF($B$2:C1198,1))","v":1197},"The Summit State School"]
[287,"The Willows State School",{"$f":"IF(ISERROR(SEARCH(Workplace_Name,Workplace_Lookup!B1199)),0,1)","v":1},{"$f":"IF(C1199=0,\"\",COUNTIF($B$2:C1199,1))","v":1198},"The Willows State School"]
[579,"Theebine State School",{"$f":"IF(ISERROR(SEARCH(Workplace_Name,Workplace_Lookup!B1200)),0,1)","v":1},{"$f":"IF(C1200=0,\"\",COUNTIF($B$2:C1200,1))","v":1199},"Theebine State School"]
[676,"Theodore State School",{"$f":"IF(ISERROR(SEARCH(Workplace_Name,Workplace_Lookup!B1201)),0,1)","v":1},{"$f":"IF(C1201=0,\"\",COUNTIF($B$2:C1201,1))","v":1200},"Theodore State School"]
[1240,"Thornlands State School",{"$f":"IF(ISERROR(SEARCH(Workplace_Name,Workplace_Lookup!B1202)),0,1)","v":1},{"$f":"IF(C1202=0,\"\",COUNTIF($B$2:C1202,1))","v":1201},"Thornlands State School"]
[245,"Thornton State School",{"$f":"IF(ISERROR(SEARCH(Workplace_Name,Workplace_Lookup!B1203)),0,1)","v":1},{"$f":"IF(C1203=0,\"\",COUNTIF($B$2:C1203,1))","v":1202},"Thornton State School"]
[803,"Thulimbah State School",{"$f":"IF(ISERROR(SEARCH(Workplace_Name,Workplace_Lookup!B1204)),0,1)","v":1},{"$f":"IF(C1204=0,\"\",COUNTIF($B$2:C1204,1))","v":1203},"Thulimbah State School"]
[2172,"Thuringowa State High School",{"$f":"IF(ISERROR(SEARCH(Workplace_Name,Workplace_Lookup!B1205)),0,1)","v":1},{"$f":"IF(C1205=0,\"\",COUNTIF($B$2:C1205,1))","v":1204},"Thuringowa State High School"]
[107,"Tiaro State School",{"$f":"IF(ISERROR(SEARCH(Workplace_Name,Workplace_Lookup!B1206)),0,1)","v":1},{"$f":"IF(C1206=0,\"\",COUNTIF($B$2:C1206,1))","v":1205},"Tiaro State School"]
[1926,"Tieri State School",{"$f":"IF(ISERROR(SEARCH(Workplace_Name,Workplace_Lookup!B1207)),0,1)","v":1},{"$f":"IF(C1207=0,\"\",COUNTIF($B$2:C1207,1))","v":1206},"Tieri State School"]
[577,"Tin Can Bay State School",{"$f":"IF(ISERROR(SEARCH(Workplace_Name,Workplace_Lookup!B1208)),0,1)","v":1},{"$f":"IF(C1208=0,\"\",COUNTIF($B$2:C1208,1))","v":1207},"Tin Can Bay State School"]
[216,"Tinana State School",{"$f":"IF(ISERROR(SEARCH(Workplace_Name,Workplace_Lookup!B1209)),0,1)","v":1},{"$f":"IF(C1209=0,\"\",COUNTIF($B$2:C1209,1))","v":1208},"Tinana State School"]
[3583,"Tinaroo Environmental Education Centre",{"$f":"IF(ISERROR(SEARCH(Workplace_Name,Workplace_Lookup!B1210)),0,1)","v":1},{"$f":"IF(C1210=0,\"\",COUNTIF($B$2:C1210,1))","v":1209},"Tinaroo Environmental Education Centre"]
[127,"Tingalpa State School",{"$f":"IF(ISERROR(SEARCH(Workplace_Name,Workplace_Lookup!B1211)),0,1)","v":1},{"$f":"IF(C1211=0,\"\",COUNTIF($B$2:C1211,1))","v":1210},"Tingalpa State School"]
[864,"Tingoora State School",{"$f":"IF(ISERROR(SEARCH(Workplace_Name,Workplace_Lookup!B1212)),0,1)","v":1},{"$f":"IF(C1212=0,\"\",COUNTIF($B$2:C1212,1))","v":1211},"Tingoora State School"]
[224,"Tivoli State School",{"$f":"IF(ISERROR(SEARCH(Workplace_Name,Workplace_Lookup!B1213)),0,1)","v":1},{"$f":"IF(C1213=0,\"\",COUNTIF($B$2:C1213,1))","v":1212},"Tivoli State School"]
[629,"Tolga State School",{"$f":"IF(ISERROR(SEARCH(Workplace_Name,Workplace_Lookup!B1214)),0,1)","v":1},{"$f":"IF(C1214=0,\"\",COUNTIF($B$2:C1214,1))","v":1213},"Tolga State School"]
[1777,"Toobanna State School",{"$f":"IF(ISERROR(SEARCH(Workplace_Name,Workplace_Lookup!B1215)),0,1)","v":1},{"$f":"IF(C1215=0,\"\",COUNTIF($B$2:C1215,1))","v":1214},"Toobanna State School"]
[2179,"Toogoolawah State High School",{"$f":"IF(ISERROR(SEARCH(Workplace_Name,Workplace_Lookup!B1216)),0,1)","v":1},{"$f":"IF(C1216=0,\"\",COUNTIF($B$2:C1216,1))","v":1215},"Toogoolawah State High School"]
[1069,"Toogoolawah State School",{"$f":"IF(ISERROR(SEARCH(Workplace_Name,Workplace_Lookup!B1217)),0,1)","v":1},{"$f":"IF(C1217=0,\"\",COUNTIF($B$2:C1217,1))","v":1216},"Toogoolawah State School"]
[2260,"Toohey Forest Environmental Education Centre",{"$f":"IF(ISERROR(SEARCH(Workplace_Name,Workplace_Lookup!B1218)),0,1)","v":1},{"$f":"IF(C1218=0,\"\",COUNTIF($B$2:C1218,1))","v":1217},"Toohey Forest Environmental Education Centre"]
[2152,"Toolooa State High School",{"$f":"IF(ISERROR(SEARCH(Workplace_Name,Workplace_Lookup!B1219)),0,1)","v":1},{"$f":"IF(C1219=0,\"\",COUNTIF($B$2:C1219,1))","v":1218},"Toolooa State High School"]
[13,"Toowong State School",{"$f":"IF(ISERROR(SEARCH(Workplace_Name,Workplace_Lookup!B1220)),0,1)","v":1},{"$f":"IF(C1220=0,\"\",COUNTIF($B$2:C1220,1))","v":1219},{"$f":"IFERROR(INDEX(B:B,MATCH(ROW(B1219),D:D,0)),\"\")","v":"Toowong State School"}]
[499,"Toowoomba East State School",{"$f":"IF(ISERROR(SEARCH(Workplace_Name,Workplace_Lookup!B1221)),0,1)","v":1},{"$f":"IF(C1221=0,\"\",COUNTIF($B$2:C1221,1))","v":1220},"Toowoomba East State School"]
[110,"Toowoomba North State School",{"$f":"IF(ISERROR(SEARCH(Workplace_Name,Workplace_Lookup!B1222)),0,1)","v":1},{"$f":"IF(C1222=0,\"\",COUNTIF($B$2:C1222,1))","v":1221},"Toowoomba North State School"]
[2013,"Toowoomba State High School",{"$f":"IF(ISERROR(SEARCH(Workplace_Name,Workplace_Lookup!B1223)),0,1)","v":1},{"$f":"IF(C1223=0,\"\",COUNTIF($B$2:C1223,1))","v":1222},"Toowoomba State High School"]
[3032,"Toowoomba West Special School",{"$f":"IF(ISERROR(SEARCH(Workplace_Name,Workplace_Lookup!B1224)),0,1)","v":1},{"$f":"IF(C1224=0,\"\",COUNTIF($B$2:C1224,1))","v":1223},"Toowoomba West Special School"]
[522,"Torbanlea State School",{"$f":"IF(ISERROR(SEARCH(Workplace_Name,Workplace_Lookup!B1225)),0,1)","v":1},{"$f":"IF(C1225=0,\"\",COUNTIF($B$2:C1225,1))","v":1224},"Torbanlea State School"]
[945,"Torquay State School",{"$f":"IF(ISERROR(SEARCH(Workplace_Name,Workplace_Lookup!B1226)),0,1)","v":1},{"$f":"IF(C1226=0,\"\",COUNTIF($B$2:C1226,1))","v":1225},"Torquay State School"]
[113,"Townsville Central State School",{"$f":"IF(ISERROR(SEARCH(Workplace_Name,Workplace_Lookup!B1227)),0,1)","v":1},{"$f":"IF(C1227=0,\"\",COUNTIF($B$2:C1227,1))","v":1226},"Townsville Central State School"]
[2376,"Townsville Community Learning Centre - A State Special School",{"$f":"IF(ISERROR(SEARCH(Workplace_Name,Workplace_Lookup!B1228)),0,1)","v":1},{"$f":"IF(C1228=0,\"\",COUNTIF($B$2:C1228,1))","v":1227},"Townsville Community Learning Centre - A State Special School"]
[303,"Townsville South State School",{"$f":"IF(ISERROR(SEARCH(Workplace_Name,Workplace_Lookup!B1229)),0,1)","v":1},{"$f":"IF(C1229=0,\"\",COUNTIF($B$2:C1229,1))","v":1228},"Townsville South State School"]
[2100,"Townsville State High School",{"$f":"IF(ISERROR(SEARCH(Workplace_Name,Workplace_Lookup!B1230)),0,1)","v":1},{"$f":"IF(C1230=0,\"\",COUNTIF($B$2:C1230,1))","v":1229},"Townsville State High School"]
[498,"Townsville West State School",{"$f":"IF(ISERROR(SEARCH(Workplace_Name,Workplace_Lookup!B1231)),0,1)","v":1},{"$f":"IF(C1231=0,\"\",COUNTIF($B$2:C1231,1))","v":1230},"Townsville West State School"]
[1203,"Townview State School",{"$f":"IF(ISERROR(SEARCH(Workplace_Name,Workplace_Lookup!B1232)),0,1)","v":1},{"$f":"IF(C1232=0,\"\",COUNTIF($B$2:C1232,1))","v":1231},"Townview State School"]
[1118,"Trebonne State School",{"$f":"IF(ISERROR(SEARCH(Workplace_Name,Workplace_Lookup!B1233)),0,1)","v":1},{"$f":"IF(C1233=0,\"\",COUNTIF($B$2:C1233,1))","v":1232},"Trebonne State School"]
[420,"Tresswell State School",{"$f":"IF(ISERROR(SEARCH(Workplace_Name,Workplace_Lookup!B1234)),0,1)","v":1},{"$f":"IF(C1234=0,\"\",COUNTIF($B$2:C1234,1))","v":1233},"Tresswell State School"]
[2057,"Trinity Bay State High School",{"$f":"IF(ISERROR(SEARCH(Workplace_Name,Workplace_Lookup!B1235)),0,1)","v":1},{"$f":"IF(C1235=0,\"\",COUNTIF($B$2:C1235,1))","v":1234},"Trinity Bay State High School"]
[2159,"Tropical North Learning Academy - Smithfield State High School",{"$f":"IF(ISERROR(SEARCH(Workplace_Name,Workplace_Lookup!B1236)),0,1)","v":1},{"$f":"IF(C1236=0,\"\",COUNTIF($B$2:C1236,1))","v":1235},"Tropical North Learning Academy - Smithfield State High School"]
[1893,"Tropical North Learning Academy - Trinity Beach State School",{"$f":"IF(ISERROR(SEARCH(Workplace_Name,Workplace_Lookup!B1237)),0,1)","v":1},{"$f":"IF(C1237=0,\"\",COUNTIF($B$2:C1237,1))","v":1236},"Tropical North Learning Academy - Trinity Beach State School"]
[2188,"Tullawong State High School",{"$f":"IF(ISERROR(SEARCH(Workplace_Name,Workplace_Lookup!B1238)),0,1)","v":1},{"$f":"IF(C1238=0,\"\",COUNTIF($B$2:C1238,1))","v":1237},"Tullawong State High School"]
[1994,"Tullawong State School",{"$f":"IF(ISERROR(SEARCH(Workplace_Name,Workplace_Lookup!B1239)),0,1)","v":1},{"$f":"IF(C1239=0,\"\",COUNTIF($B$2:C1239,1))","v":1238},"Tullawong State School"]
[2103,"Tully State High School",{"$f":"IF(ISERROR(SEARCH(Workplace_Name,Workplace_Lookup!B1240)),0,1)","v":1},{"$f":"IF(C1240=0,\"\",COUNTIF($B$2:C1240,1))","v":1239},"Tully State High School"]
[1008,"Tully State School",{"$f":"IF(ISERROR(SEARCH(Workplace_Name,Workplace_Lookup!B1241)),0,1)","v":1},{"$f":"IF(C1241=0,\"\",COUNTIF($B$2:C1241,1))","v":1240},"Tully State School"]
[361,"Two Mile State School",{"$f":"IF(ISERROR(SEARCH(Workplace_Name,Workplace_Lookup!B1242)),0,1)","v":1},{"$f":"IF(C1242=0,\"\",COUNTIF($B$2:C1242,1))","v":1241},"Two Mile State School"]
[879,"Ubobo State School",{"$f":"IF(ISERROR(SEARCH(Workplace_Name,Workplace_Lookup!B1243)),0,1)","v":1},{"$f":"IF(C1243=0,\"\",COUNTIF($B$2:C1243,1))","v":1242},"Ubobo State School"]
[1877,"Undurba State School",{"$f":"IF(ISERROR(SEARCH(Workplace_Name,Workplace_Lookup!B1244)),0,1)","v":1},{"$f":"IF(C1244=0,\"\",COUNTIF($B$2:C1244,1))","v":1243},"Undurba State School"]
[1501,"Upper Brookfield State School",{"$f":"IF(ISERROR(SEARCH(Workplace_Name,Workplace_Lookup!B1245)),0,1)","v":1},{"$f":"IF(C1245=0,\"\",COUNTIF($B$2:C1245,1))","v":1244},"Upper Brookfield State School"]
[2340,"Upper Coomera State College",{"$f":"IF(ISERROR(SEARCH(Workplace_Name,Workplace_Lookup!B1246)),0,1)","v":1},{"$f":"IF(C1246=0,\"\",COUNTIF($B$2:C1246,1))","v":1245},"Upper Coomera State College"]
[128,"Upper Mount Gravatt State School",{"$f":"IF(ISERROR(SEARCH(Workplace_Name,Workplace_Lookup!B1247)),0,1)","v":1},{"$f":"IF(C1247=0,\"\",COUNTIF($B$2:C1247,1))","v":1246},"Upper Mount Gravatt State School"]
[1755,"Urandangi State School",{"$f":"IF(ISERROR(SEARCH(Workplace_Name,Workplace_Lookup!B1248)),0,1)","v":1},{"$f":"IF(C1248=0,\"\",COUNTIF($B$2:C1248,1))","v":1247},"Urandangi State School"]
[1536,"Urangan Point State School",{"$f":"IF(ISERROR(SEARCH(Workplace_Name,Workplace_Lookup!B1249)),0,1)","v":1},{"$f":"IF(C1249=0,\"\",COUNTIF($B$2:C1249,1))","v":1248},"Urangan Point State School"]
[2110,"Urangan State High School",{"$f":"IF(ISERROR(SEARCH(Workplace_Name,Workplace_Lookup!B1250)),0,1)","v":1},{"$f":"IF(C1250=0,\"\",COUNTIF($B$2:C1250,1))","v":1249},"Urangan State High School"]
[844,"Vale View State School",{"$f":"IF(ISERROR(SEARCH(Workplace_Name,Workplace_Lookup!B1251)),0,1)","v":1},{"$f":"IF(C1251=0,\"\",COUNTIF($B$2:C1251,1))","v":1250},"Vale View State School"]
[403,"Valkyrie State School",{"$f":"IF(ISERROR(SEARCH(Workplace_Name,Workplace_Lookup!B1252)),0,1)","v":1},{"$f":"IF(C1252=0,\"\",COUNTIF($B$2:C1252,1))","v":1251},"Valkyrie State School"]
[1759,"Varsity College",{"$f":"IF(ISERROR(SEARCH(Workplace_Name,Workplace_Lookup!B1253)),0,1)","v":1},{"$f":"IF(C1253=0,\"\",COUNTIF($B$2:C1253,1))","v":1252},"Varsity College"]
[869,"Veresdale Scrub State School",{"$f":"IF(ISERROR(SEARCH(Workplace_Name,Workplace_Lookup!B1254)),0,1)","v":1},{"$f":"IF(C1254=0,\"\",COUNTIF($B$2:C1254,1))","v":1253},"Veresdale Scrub State School"]
[1855,"Victoria Park State School",{"$f":"IF(ISERROR(SEARCH(Workplace_Name,Workplace_Lookup!B1255)),0,1)","v":1},{"$f":"IF(C1255=0,\"\",COUNTIF($B$2:C1255,1))","v":1254},"Victoria Park State School"]
[628,"Victoria Plantation State School",{"$f":"IF(ISERROR(SEARCH(Workplace_Name,Workplace_Lookup!B1256)),0,1)","v":1},{"$f":"IF(C1256=0,\"\",COUNTIF($B$2:C1256,1))","v":1255},"Victoria Plantation State School"]
[234,"Victoria Point State High School",{"$f":"IF(ISERROR(SEARCH(Workplace_Name,Workplace_Lookup!B1257)),0,1)","v":1},{"$f":"IF(C1257=0,\"\",COUNTIF($B$2:C1257,1))","v":1256},"Victoria Point State High School"]
[1512,"Victoria Point State School",{"$f":"IF(ISERROR(SEARCH(Workplace_Name,Workplace_Lookup!B1258)),0,1)","v":1},{"$f":"IF(C1258=0,\"\",COUNTIF($B$2:C1258,1))","v":1257},"Victoria Point State School"]
[1936,"Vienna Woods State School",{"$f":"IF(ISERROR(SEARCH(Workplace_Name,Workplace_Lookup!B1259)),0,1)","v":1},{"$f":"IF(C1259=0,\"\",COUNTIF($B$2:C1259,1))","v":1258},"Vienna Woods State School"]
[948,"Vincent State School",{"$f":"IF(ISERROR(SEARCH(Workplace_Name,Workplace_Lookup!B1260)),0,1)","v":1},{"$f":"IF(C1260=0,\"\",COUNTIF($B$2:C1260,1))","v":1259},"Vincent State School"]
[1675,"Virginia State School",{"$f":"IF(ISERROR(SEARCH(Workplace_Name,Workplace_Lookup!B1261)),0,1)","v":1},{"$f":"IF(C1261=0,\"\",COUNTIF($B$2:C1261,1))","v":1260},"Virginia State School"]
[760,"Walkamin State School",{"$f":"IF(ISERROR(SEARCH(Workplace_Name,Workplace_Lookup!B1262)),0,1)","v":1},{"$f":"IF(C1262=0,\"\",COUNTIF($B$2:C1262,1))","v":1261},"Walkamin State School"]
[353,"Walkerston State School",{"$f":"IF(ISERROR(SEARCH(Workplace_Name,Workplace_Lookup!B1263)),0,1)","v":1},{"$f":"IF(C1263=0,\"\",COUNTIF($B$2:C1263,1))","v":1262},"Walkerston State School"]
[536,"Walkervale State School",{"$f":"IF(ISERROR(SEARCH(Workplace_Name,Workplace_Lookup!B1264)),0,1)","v":1},{"$f":"IF(C1264=0,\"\",COUNTIF($B$2:C1264,1))","v":1263},"Walkervale State School"]
[458,"Wallangarra State School",{"$f":"IF(ISERROR(SEARCH(Workplace_Name,Workplace_Lookup!B1265)),0,1)","v":1},{"$f":"IF(C1265=0,\"\",COUNTIF($B$2:C1265,1))","v":1264},"Wallangarra State School"]
[1192,"Wallaville State School",{"$f":"IF(ISERROR(SEARCH(Workplace_Name,Workplace_Lookup!B1266)),0,1)","v":1},{"$f":"IF(C1266=0,\"\",COUNTIF($B$2:C1266,1))","v":1265},"Wallaville State School"]
[285,"Walloon State School",{"$f":"IF(ISERROR(SEARCH(Workplace_Name,Workplace_Lookup!B1267)),0,1)","v":1},{"$f":"IF(C1267=0,\"\",COUNTIF($B$2:C1267,1))","v":1266},"Walloon State School"]
[182,"Wallumbilla State School",{"$f":"IF(ISERROR(SEARCH(Workplace_Name,Workplace_Lookup!B1268)),0,1)","v":1},{"$f":"IF(C1268=0,\"\",COUNTIF($B$2:C1268,1))","v":1267},"Wallumbilla State School"]
[1724,"Wamuran State School",{"$f":"IF(ISERROR(SEARCH(Workplace_Name,Workplace_Lookup!B1269)),0,1)","v":1},{"$f":"IF(C1269=0,\"\",COUNTIF($B$2:C1269,1))","v":1268},"Wamuran State School"]
[1296,"Wandoan State School P-10",{"$f":"IF(ISERROR(SEARCH(Workplace_Name,Workplace_Lookup!B1270)),0,1)","v":1},{"$f":"IF(C1270=0,\"\",COUNTIF($B$2:C1270,1))","v":1269},"Wandoan State School P-10"]
[1971,"Waraburra State School",{"$f":"IF(ISERROR(SEARCH(Workplace_Name,Workplace_Lookup!B1271)),0,1)","v":1},{"$f":"IF(C1271=0,\"\",COUNTIF($B$2:C1271,1))","v":1270},"Waraburra State School"]
[386,"Warra State School",{"$f":"IF(ISERROR(SEARCH(Workplace_Name,Workplace_Lookup!B1272)),0,1)","v":1},{"$f":"IF(C1272=0,\"\",COUNTIF($B$2:C1272,1))","v":1271},"Warra State School"]
[1885,"Warrigal Road State School",{"$f":"IF(ISERROR(SEARCH(Workplace_Name,Workplace_Lookup!B1273)),0,1)","v":1},{"$f":"IF(C1273=0,\"\",COUNTIF($B$2:C1273,1))","v":1272},"Warrigal Road State School"]
[1230,"Warrill View State School",{"$f":"IF(ISERROR(SEARCH(Workplace_Name,Workplace_Lookup!B1274)),0,1)","v":1},{"$f":"IF(C1274=0,\"\",COUNTIF($B$2:C1274,1))","v":1273},"Warrill View State School"]
[1159,"Wartburg State School",{"$f":"IF(ISERROR(SEARCH(Workplace_Name,Workplace_Lookup!B1275)),0,1)","v":1},{"$f":"IF(C1275=0,\"\",COUNTIF($B$2:C1275,1))","v":1274},"Wartburg State School"]
[116,"Warwick Central State School",{"$f":"IF(ISERROR(SEARCH(Workplace_Name,Workplace_Lookup!B1276)),0,1)","v":1},{"$f":"IF(C1276=0,\"\",COUNTIF($B$2:C1276,1))","v":1275},"Warwick Central State School"]
[225,"Warwick East State School",{"$f":"IF(ISERROR(SEARCH(Workplace_Name,Workplace_Lookup!B1277)),0,1)","v":1},{"$f":"IF(C1277=0,\"\",COUNTIF($B$2:C1277,1))","v":1276},"Warwick East State School"]
[2015,"Warwick State High School",{"$f":"IF(ISERROR(SEARCH(Workplace_Name,Workplace_Lookup!B1278)),0,1)","v":1},{"$f":"IF(C1278=0,\"\",COUNTIF($B$2:C1278,1))","v":1277},"Warwick State High School"]
[1152,"Warwick West State School",{"$f":"IF(ISERROR(SEARCH(Workplace_Name,Workplace_Lookup!B1279)),0,1)","v":1},{"$f":"IF(C1279=0,\"\",COUNTIF($B$2:C1279,1))","v":1278},"Warwick West State School"]
[130,"Waterford State School",{"$f":"IF(ISERROR(SEARCH(Workplace_Name,Workplace_Lookup!B1280)),0,1)","v":1},{"$f":"IF(C1280=0,\"\",COUNTIF($B$2:C1280,1))","v":1279},"Waterford State School"]
[1856,"Waterford West State School",{"$f":"IF(ISERROR(SEARCH(Workplace_Name,Workplace_Lookup!B1281)),0,1)","v":1},{"$f":"IF(C1281=0,\"\",COUNTIF($B$2:C1281,1))","v":1280},"Waterford West State School"]
[584,"Watson Road State School",{"$f":"IF(ISERROR(SEARCH(Workplace_Name,Workplace_Lookup!B1282)),0,1)","v":1},{"$f":"IF(C1282=0,\"\",COUNTIF($B$2:C1282,1))","v":1281},"Watson Road State School"]
[1149,"Wavell Heights State School",{"$f":"IF(ISERROR(SEARCH(Workplace_Name,Workplace_Lookup!B1283)),0,1)","v":1},{"$f":"IF(C1283=0,\"\",COUNTIF($B$2:C1283,1))","v":1282},"Wavell Heights State School"]
[2048,"Wavell State High School",{"$f":"IF(ISERROR(SEARCH(Workplace_Name,Workplace_Lookup!B1284)),0,1)","v":1},{"$f":"IF(C1284=0,\"\",COUNTIF($B$2:C1284,1))","v":1283},{"$f":"IFERROR(INDEX(B:B,MATCH(ROW(B1283),D:D,0)),\"\")","v":"Wavell State High School"}]
[395,"Weir State School",{"$f":"IF(ISERROR(SEARCH(Workplace_Name,Workplace_Lookup!B1285)),0,1)","v":1},{"$f":"IF(C1285=0,\"\",COUNTIF($B$2:C1285,1))","v":1284},"Weir State School"]
[855,"Wellcamp State School",{"$f":"IF(ISERROR(SEARCH(Workplace_Name,Workplace_Lookup!B1286)),0,1)","v":1},{"$f":"IF(C1286=0,\"\",COUNTIF($B$2:C1286,1))","v":1285},"Wellcamp State School"]
[1844,"Wellers Hill State School",{"$f":"IF(ISERROR(SEARCH(Workplace_Name,Workplace_Lookup!B1287)),0,1)","v":1},{"$f":"IF(C1287=0,\"\",COUNTIF($B$2:C1287,1))","v":1286},"Wellers Hill State School"]
[2178,"Wellington Point State High School",{"$f":"IF(ISERROR(SEARCH(Workplace_Name,Workplace_Lookup!B1288)),0,1)","v":1},{"$f":"IF(C1288=0,\"\",COUNTIF($B$2:C1288,1))","v":1287},"Wellington Point State High School"]
[273,"Wellington Point State School",{"$f":"IF(ISERROR(SEARCH(Workplace_Name,Workplace_Lookup!B1289)),0,1)","v":1},{"$f":"IF(C1289=0,\"\",COUNTIF($B$2:C1289,1))","v":1288},"Wellington Point State School"]
[212,"West End State School",{"$f":"IF(ISERROR(SEARCH(Workplace_Name,Workplace_Lookup!B1290)),0,1)","v":1},{"$f":"IF(C1290=0,\"\",COUNTIF($B$2:C1290,1))","v":1289},"West End State School"]
["A966","West Moreton Education and Training Centre ",{"$f":"IF(ISERROR(SEARCH(Workplace_Name,Workplace_Lookup!B1291)),0,1)","v":1},{"$f":"IF(C1291=0,\"\",COUNTIF($B$2:C1291,1))","v":1290},"West Moreton Education and Training Centre "]
[82,"Western Cape College - Mapoon",{"$f":"IF(ISERROR(SEARCH(Workplace_Name,Workplace_Lookup!B1292)),0,1)","v":1},{"$f":"IF(C1292=0,\"\",COUNTIF($B$2:C1292,1))","v":1291},"Western Cape College - Mapoon"]
[1407,"Western Cape College - Weipa",{"$f":"IF(ISERROR(SEARCH(Workplace_Name,Workplace_Lookup!B1293)),0,1)","v":1},{"$f":"IF(C1293=0,\"\",COUNTIF($B$2:C1293,1))","v":1292},"Western Cape College - Weipa"]
[8014,"Western Cape College Residential Centre",{"$f":"IF(ISERROR(SEARCH(Workplace_Name,Workplace_Lookup!B1294)),0,1)","v":1},{"$f":"IF(C1294=0,\"\",COUNTIF($B$2:C1294,1))","v":1293},"Western Cape College Residential Centre"]
[3014,"Western Suburbs State Special School",{"$f":"IF(ISERROR(SEARCH(Workplace_Name,Workplace_Lookup!B1295)),0,1)","v":1},{"$f":"IF(C1295=0,\"\",COUNTIF($B$2:C1295,1))","v":1294},"Western Suburbs State Special School"]
[1244,"Westmar State School",{"$f":"IF(ISERROR(SEARCH(Workplace_Name,Workplace_Lookup!B1296)),0,1)","v":1},{"$f":"IF(C1296=0,\"\",COUNTIF($B$2:C1296,1))","v":1295},"Westmar State School"]
[119,"Westwood State School",{"$f":"IF(ISERROR(SEARCH(Workplace_Name,Workplace_Lookup!B1297)),0,1)","v":1},{"$f":"IF(C1297=0,\"\",COUNTIF($B$2:C1297,1))","v":1296},"Westwood State School"]
[1405,"Wheatlands State School",{"$f":"IF(ISERROR(SEARCH(Workplace_Name,Workplace_Lookup!B1298)),0,1)","v":1},{"$f":"IF(C1298=0,\"\",COUNTIF($B$2:C1298,1))","v":1297},"Wheatlands State School"]
[1147,"Wheatvale State School",{"$f":"IF(ISERROR(SEARCH(Workplace_Name,Workplace_Lookup!B1299)),0,1)","v":1},{"$f":"IF(C1299=0,\"\",COUNTIF($B$2:C1299,1))","v":1298},"Wheatvale State School"]
[1978,"White Rock State School",{"$f":"IF(ISERROR(SEARCH(Workplace_Name,Workplace_Lookup!B1300)),0,1)","v":1},{"$f":"IF(C1300=0,\"\",COUNTIF($B$2:C1300,1))","v":1299},"White Rock State School"]
[2410,"Whites Hill State College",{"$f":"IF(ISERROR(SEARCH(Workplace_Name,Workplace_Lookup!B1301)),0,1)","v":1},{"$f":"IF(C1301=0,\"\",COUNTIF($B$2:C1301,1))","v":1300},"Whites Hill State College"]
[1980,"Whitfield State School",{"$f":"IF(ISERROR(SEARCH(Workplace_Name,Workplace_Lookup!B1302)),0,1)","v":1},{"$f":"IF(C1302=0,\"\",COUNTIF($B$2:C1302,1))","v":1301},"Whitfield State School"]
[669,"Widgee State School",{"$f":"IF(ISERROR(SEARCH(Workplace_Name,Workplace_Lookup!B1303)),0,1)","v":1},{"$f":"IF(C1303=0,\"\",COUNTIF($B$2:C1303,1))","v":1302},"Widgee State School"]
[1972,"William Duncan State School",{"$f":"IF(ISERROR(SEARCH(Workplace_Name,Workplace_Lookup!B1304)),0,1)","v":1},{"$f":"IF(C1304=0,\"\",COUNTIF($B$2:C1304,1))","v":1303},"William Duncan State School"]
[2186,"William Ross State High School",{"$f":"IF(ISERROR(SEARCH(Workplace_Name,Workplace_Lookup!B1305)),0,1)","v":1},{"$f":"IF(C1305=0,\"\",COUNTIF($B$2:C1305,1))","v":1304},"William Ross State High School"]
[468,"Wilsonton State High School",{"$f":"IF(ISERROR(SEARCH(Workplace_Name,Workplace_Lookup!B1306)),0,1)","v":1},{"$f":"IF(C1306=0,\"\",COUNTIF($B$2:C1306,1))","v":1305},"Wilsonton State High School"]
[394,"Wilsonton State School",{"$f":"IF(ISERROR(SEARCH(Workplace_Name,Workplace_Lookup!B1307)),0,1)","v":1},{"$f":"IF(C1307=0,\"\",COUNTIF($B$2:C1307,1))","v":1306},"Wilsonton State School"]
[1485,"Wilston State School",{"$f":"IF(ISERROR(SEARCH(Workplace_Name,Workplace_Lookup!B1308)),0,1)","v":1},{"$f":"IF(C1308=0,\"\",COUNTIF($B$2:C1308,1))","v":1307},"Wilston State School"]
[1990,"Windaroo State School",{"$f":"IF(ISERROR(SEARCH(Workplace_Name,Workplace_Lookup!B1309)),0,1)","v":1},{"$f":"IF(C1309=0,\"\",COUNTIF($B$2:C1309,1))","v":1308},"Windaroo State School"]
[2189,"Windaroo Valley State High School",{"$f":"IF(ISERROR(SEARCH(Workplace_Name,Workplace_Lookup!B1310)),0,1)","v":1},{"$f":"IF(C1310=0,\"\",COUNTIF($B$2:C1310,1))","v":1309},"Windaroo Valley State High School"]
[292,"Windera State School",{"$f":"IF(ISERROR(SEARCH(Workplace_Name,Workplace_Lookup!B1311)),0,1)","v":1},{"$f":"IF(C1311=0,\"\",COUNTIF($B$2:C1311,1))","v":1310},"Windera State School"]
[461,"Windorah State School",{"$f":"IF(ISERROR(SEARCH(Workplace_Name,Workplace_Lookup!B1312)),0,1)","v":1},{"$f":"IF(C1312=0,\"\",COUNTIF($B$2:C1312,1))","v":1311},"Windorah State School"]
[11,"Windsor State School",{"$f":"IF(ISERROR(SEARCH(Workplace_Name,Workplace_Lookup!B1313)),0,1)","v":1},{"$f":"IF(C1313=0,\"\",COUNTIF($B$2:C1313,1))","v":1312},"Windsor State School"]
[603,"Winfield State School",{"$f":"IF(ISERROR(SEARCH(Workplace_Name,Workplace_Lookup!B1314)),0,1)","v":1},{"$f":"IF(C1314=0,\"\",COUNTIF($B$2:C1314,1))","v":1313},"Winfield State School"]
[478,"Winton State School",{"$f":"IF(ISERROR(SEARCH(Workplace_Name,Workplace_Lookup!B1315)),0,1)","v":1},{"$f":"IF(C1315=0,\"\",COUNTIF($B$2:C1315,1))","v":1314},"Winton State School"]
[633,"Wishart State School",{"$f":"IF(ISERROR(SEARCH(Workplace_Name,Workplace_Lookup!B1316)),0,1)","v":1},{"$f":"IF(C1316=0,\"\",COUNTIF($B$2:C1316,1))","v":1315},"Wishart State School"]
[1930,"Withcott State School",{"$f":"IF(ISERROR(SEARCH(Workplace_Name,Workplace_Lookup!B1317)),0,1)","v":1},{"$f":"IF(C1317=0,\"\",COUNTIF($B$2:C1317,1))","v":1316},"Withcott State School"]
[881,"Wolvi State School",{"$f":"IF(ISERROR(SEARCH(Workplace_Name,Workplace_Lookup!B1318)),0,1)","v":1},{"$f":"IF(C1318=0,\"\",COUNTIF($B$2:C1318,1))","v":1317},"Wolvi State School"]
[1065,"Wondai State School",{"$f":"IF(ISERROR(SEARCH(Workplace_Name,Workplace_Lookup!B1319)),0,1)","v":1},{"$f":"IF(C1319=0,\"\",COUNTIF($B$2:C1319,1))","v":1318},"Wondai State School"]
[416,"Wondall Heights State School",{"$f":"IF(ISERROR(SEARCH(Workplace_Name,Workplace_Lookup!B1320)),0,1)","v":1},{"$f":"IF(C1320=0,\"\",COUNTIF($B$2:C1320,1))","v":1319},"Wondall Heights State School"]
[1614,"Wonga Beach State School",{"$f":"IF(ISERROR(SEARCH(Workplace_Name,Workplace_Lookup!B1321)),0,1)","v":1},{"$f":"IF(C1321=0,\"\",COUNTIF($B$2:C1321,1))","v":1320},"Wonga Beach State School"]
[456,"Woodcrest State College",{"$f":"IF(ISERROR(SEARCH(Workplace_Name,Workplace_Lookup!B1322)),0,1)","v":1},{"$f":"IF(C1322=0,\"\",COUNTIF($B$2:C1322,1))","v":1321},"Woodcrest State College"]
[370,"Woodford State School",{"$f":"IF(ISERROR(SEARCH(Workplace_Name,Workplace_Lookup!B1323)),0,1)","v":1},{"$f":"IF(C1323=0,\"\",COUNTIF($B$2:C1323,1))","v":1322},"Woodford State School"]
[122,"Woodhill State School",{"$f":"IF(ISERROR(SEARCH(Workplace_Name,Workplace_Lookup!B1324)),0,1)","v":1},{"$f":"IF(C1324=0,\"\",COUNTIF($B$2:C1324,1))","v":1323},"Woodhill State School"]
[7121,"WoodLinks State School",{"$f":"IF(ISERROR(SEARCH(Workplace_Name,Workplace_Lookup!B1325)),0,1)","v":1},{"$f":"IF(C1325=0,\"\",COUNTIF($B$2:C1325,1))","v":1324},"WoodLinks State School"]
[647,"Woodridge North State School",{"$f":"IF(ISERROR(SEARCH(Workplace_Name,Workplace_Lookup!B1326)),0,1)","v":1},{"$f":"IF(C1326=0,\"\",COUNTIF($B$2:C1326,1))","v":1325},"Woodridge North State School"]
[2128,"Woodridge State High School",{"$f":"IF(ISERROR(SEARCH(Workplace_Name,Workplace_Lookup!B1327)),0,1)","v":1},{"$f":"IF(C1327=0,\"\",COUNTIF($B$2:C1327,1))","v":1326},"Woodridge State High School"]
[704,"Woodridge State School",{"$f":"IF(ISERROR(SEARCH(Workplace_Name,Workplace_Lookup!B1328)),0,1)","v":1},{"$f":"IF(C1328=0,\"\",COUNTIF($B$2:C1328,1))","v":1327},"Woodridge State School"]
[615,"Woodstock State School",{"$f":"IF(ISERROR(SEARCH(Workplace_Name,Workplace_Lookup!B1329)),0,1)","v":1},{"$f":"IF(C1329=0,\"\",COUNTIF($B$2:C1329,1))","v":1328},"Woodstock State School"]
[3042,"Woody Point Special School",{"$f":"IF(ISERROR(SEARCH(Workplace_Name,Workplace_Lookup!B1330)),0,1)","v":1},{"$f":"IF(C1330=0,\"\",COUNTIF($B$2:C1330,1))","v":1329},"Woody Point Special School"]
["A918","Woogaroo Creek State School",{"$f":"IF(ISERROR(SEARCH(Workplace_Name,Workplace_Lookup!B1331)),0,1)","v":1},{"$f":"IF(C1331=0,\"\",COUNTIF($B$2:C1331,1))","v":1330},"Woogaroo Creek State School"]
[1378,"Woolooga State School",{"$f":"IF(ISERROR(SEARCH(Workplace_Name,Workplace_Lookup!B1332)),0,1)","v":1},{"$f":"IF(C1332=0,\"\",COUNTIF($B$2:C1332,1))","v":1331},"Woolooga State School"]
[1463,"Wooloowin State School",{"$f":"IF(ISERROR(SEARCH(Workplace_Name,Workplace_Lookup!B1333)),0,1)","v":1},{"$f":"IF(C1333=0,\"\",COUNTIF($B$2:C1333,1))","v":1332},"Wooloowin State School"]
[476,"Woombye State School",{"$f":"IF(ISERROR(SEARCH(Workplace_Name,Workplace_Lookup!B1334)),0,1)","v":1},{"$f":"IF(C1334=0,\"\",COUNTIF($B$2:C1334,1))","v":1333},"Woombye State School"]
[350,"Woongarra State School",{"$f":"IF(ISERROR(SEARCH(Workplace_Name,Workplace_Lookup!B1335)),0,1)","v":1},{"$f":"IF(C1335=0,\"\",COUNTIF($B$2:C1335,1))","v":1334},"Woongarra State School"]
[39,"Woongoolba State School",{"$f":"IF(ISERROR(SEARCH(Workplace_Name,Workplace_Lookup!B1336)),0,1)","v":1},{"$f":"IF(C1336=0,\"\",COUNTIF($B$2:C1336,1))","v":1335},"Woongoolba State School"]
[617,"Woorabinda State School",{"$f":"IF(ISERROR(SEARCH(Workplace_Name,Workplace_Lookup!B1337)),0,1)","v":1},{"$f":"IF(C1337=0,\"\",COUNTIF($B$2:C1337,1))","v":1336},"Woorabinda State School"]
[947,"Wooroolin State School",{"$f":"IF(ISERROR(SEARCH(Workplace_Name,Workplace_Lookup!B1338)),0,1)","v":1},{"$f":"IF(C1338=0,\"\",COUNTIF($B$2:C1338,1))","v":1337},"Wooroolin State School"]
[7383,"Woree SHS - SchoolTech Campus",{"$f":"IF(ISERROR(SEARCH(Workplace_Name,Workplace_Lookup!B1339)),0,1)","v":1},{"$f":"IF(C1339=0,\"\",COUNTIF($B$2:C1339,1))","v":1338},"Woree SHS - SchoolTech Campus"]
[2162,"Woree State High School",{"$f":"IF(ISERROR(SEARCH(Workplace_Name,Workplace_Lookup!B1340)),0,1)","v":1},{"$f":"IF(C1340=0,\"\",COUNTIF($B$2:C1340,1))","v":1339},"Woree State High School"]
[1902,"Woree State School",{"$f":"IF(ISERROR(SEARCH(Workplace_Name,Workplace_Lookup!B1341)),0,1)","v":1},{"$f":"IF(C1341=0,\"\",COUNTIF($B$2:C1341,1))","v":1340},"Woree State School"]
[1993,"Worongary State School",{"$f":"IF(ISERROR(SEARCH(Workplace_Name,Workplace_Lookup!B1342)),0,1)","v":1},{"$f":"IF(C1342=0,\"\",COUNTIF($B$2:C1342,1))","v":1341},"Worongary State School"]
[919,"Wowan State School",{"$f":"IF(ISERROR(SEARCH(Workplace_Name,Workplace_Lookup!B1343)),0,1)","v":1},{"$f":"IF(C1343=0,\"\",COUNTIF($B$2:C1343,1))","v":1342},"Wowan State School"]
[547,"Wulguru State School",{"$f":"IF(ISERROR(SEARCH(Workplace_Name,Workplace_Lookup!B1344)),0,1)","v":1},{"$f":"IF(C1344=0,\"\",COUNTIF($B$2:C1344,1))","v":1343},"Wulguru State School"]
[802,"Wyandra State School",{"$f":"IF(ISERROR(SEARCH(Workplace_Name,Workplace_Lookup!B1345)),0,1)","v":1},{"$f":"IF(C1345=0,\"\",COUNTIF($B$2:C1345,1))","v":1344},"Wyandra State School"]
[2021,"Wynnum State High School",{"$f":"IF(ISERROR(SEARCH(Workplace_Name,Workplace_Lookup!B1346)),0,1)","v":1},{"$f":"IF(C1346=0,\"\",COUNTIF($B$2:C1346,1))","v":1345},"Wynnum State High School"]
[6981,"Wynnum State School",{"$f":"IF(ISERROR(SEARCH(Workplace_Name,Workplace_Lookup!B1347)),0,1)","v":1},{"$f":"IF(C1347=0,\"\",COUNTIF($B$2:C1347,1))","v":1346},"Wynnum State School"]
[1765,"Wynnum West State School",{"$f":"IF(ISERROR(SEARCH(Workplace_Name,Workplace_Lookup!B1348)),0,1)","v":1},{"$f":"IF(C1348=0,\"\",COUNTIF($B$2:C1348,1))","v":1347},{"$f":"IFERROR(INDEX(B:B,MATCH(ROW(B1347),D:D,0)),\"\")","v":"Wynnum West State School"}]
[524,"Wyreema State School",{"$f":"IF(ISERROR(SEARCH(Workplace_Name,Workplace_Lookup!B1349)),0,1)","v":1},{"$f":"IF(C1349=0,\"\",COUNTIF($B$2:C1349,1))","v":1348},"Wyreema State School"]
[1634,"Yandaran State School",{"$f":"IF(ISERROR(SEARCH(Workplace_Name,Workplace_Lookup!B1350)),0,1)","v":1},{"$f":"IF(C1350=0,\"\",COUNTIF($B$2:C1350,1))","v":1349},"Yandaran State School"]
[491,"Yandina State School",{"$f":"IF(ISERROR(SEARCH(Workplace_Name,Workplace_Lookup!B1351)),0,1)","v":1},{"$f":"IF(C1351=0,\"\",COUNTIF($B$2:C1351,1))","v":1350},"Yandina State School"]
[151,"Yangan State School",{"$f":"IF(ISERROR(SEARCH(Workplace_Name,Workplace_Lookup!B1352)),0,1)","v":1},{"$f":"IF(C1352=0,\"\",COUNTIF($B$2:C1352,1))","v":1351},"Yangan State School"]
[6129,"Yarrabah State School - Kindergarten Campus",{"$f":"IF(ISERROR(SEARCH(Workplace_Name,Workplace_Lookup!B1353)),0,1)","v":1},{"$f":"IF(C1353=0,\"\",COUNTIF($B$2:C1353,1))","v":1352},"Yarrabah State School - Kindergarten Campus"]
[6127,"Yarrabah State School - Primary Campus",{"$f":"IF(ISERROR(SEARCH(Workplace_Name,Workplace_Lookup!B1354)),0,1)","v":1},{"$f":"IF(C1354=0,\"\",COUNTIF($B$2:C1354,1))","v":1353},"Yarrabah State School - Primary Campus"]
[6128,"Yarrabah State School - Secondary Campus",{"$f":"IF(ISERROR(SEARCH(Workplace_Name,Workplace_Lookup!B1355)),0,1)","v":1},{"$f":"IF(C1355=0,\"\",COUNTIF($B$2:C1355,1))","v":1354},"Yarrabah State School - Secondary Campus"]
["A068","Yarrabilba State School",{"$f":"IF(ISERROR(SEARCH(Workplace_Name,Workplace_Lookup!B1356)),0,1)","v":1},{"$f":"IF(C1356=0,\"\",COUNTIF($B$2:C1356,1))","v":1355},"Yarrabilba State School"]
["A789","Yarrabilba State Secondary College",{"$f":"IF(ISERROR(SEARCH(Workplace_Name,Workplace_Lookup!B1357)),0,1)","v":1},{"$f":"IF(C1357=0,\"\",COUNTIF($B$2:C1357,1))","v":1356},"Yarrabilba State Secondary College"]
[967,"Yarraman State School",{"$f":"IF(ISERROR(SEARCH(Workplace_Name,Workplace_Lookup!B1358)),0,1)","v":1},{"$f":"IF(C1358=0,\"\",COUNTIF($B$2:C1358,1))","v":1357},"Yarraman State School"]
[1746,"Yarrilee State School",{"$f":"IF(ISERROR(SEARCH(Workplace_Name,Workplace_Lookup!B1359)),0,1)","v":1},{"$f":"IF(C1359=0,\"\",COUNTIF($B$2:C1359,1))","v":1358},"Yarrilee State School"]
[1098,"Yarwun State School",{"$f":"IF(ISERROR(SEARCH(Workplace_Name,Workplace_Lookup!B1360)),0,1)","v":1},{"$f":"IF(C1360=0,\"\",COUNTIF($B$2:C1360,1))","v":1359},"Yarwun State School"]
[1346,"Yelarbon State School",{"$f":"IF(ISERROR(SEARCH(Workplace_Name,Workplace_Lookup!B1361)),0,1)","v":1},{"$f":"IF(C1361=0,\"\",COUNTIF($B$2:C1361,1))","v":1360},"Yelarbon State School"]
[2123,"Yeppoon State High School",{"$f":"IF(ISERROR(SEARCH(Workplace_Name,Workplace_Lookup!B1362)),0,1)","v":1},{"$f":"IF(C1362=0,\"\",COUNTIF($B$2:C1362,1))","v":1361},"Yeppoon State High School"]
[442,"Yeppoon State School",{"$f":"IF(ISERROR(SEARCH(Workplace_Name,Workplace_Lookup!B1363)),0,1)","v":1},{"$f":"IF(C1363=0,\"\",COUNTIF($B$2:C1363,1))","v":1362},"Yeppoon State School"]
[2054,"Yeronga State High School",{"$f":"IF(ISERROR(SEARCH(Workplace_Name,Workplace_Lookup!B1364)),0,1)","v":1},{"$f":"IF(C1364=0,\"\",COUNTIF($B$2:C1364,1))","v":1363},"Yeronga State High School"]
[8,"Yeronga State School",{"$f":"IF(ISERROR(SEARCH(Workplace_Name,Workplace_Lookup!B1365)),0,1)","v":1},{"$f":"IF(C1365=0,\"\",COUNTIF($B$2:C1365,1))","v":1364},"Yeronga State School"]
[757,"Yorkeys Knob State School",{"$f":"IF(ISERROR(SEARCH(Workplace_Name,Workplace_Lookup!B1366)),0,1)","v":1},{"$f":"IF(C1366=0,\"\",COUNTIF($B$2:C1366,1))","v":1365},"Yorkeys Knob State School"]
[1954,"Yugumbir State School",{"$f":"IF(ISERROR(SEARCH(Workplace_Name,Workplace_Lookup!B1367)),0,1)","v":1},{"$f":"IF(C1367=0,\"\",COUNTIF($B$2:C1367,1))","v":1366},"Yugumbir State School"]
[372,"Yuleba State School",{"$f":"IF(ISERROR(SEARCH(Workplace_Name,Workplace_Lookup!B1368)),0,1)","v":1},{"$f":"IF(C1368=0,\"\",COUNTIF($B$2:C1368,1))","v":1367},"Yuleba State School"]
[1002,"Yungaburra State School",{"$f":"IF(ISERROR(SEARCH(Workplace_Name,Workplace_Lookup!B1369)),0,1)","v":1},{"$f":"IF(C1369=0,\"\",COUNTIF($B$2:C1369,1))","v":1368},"Yungaburra State School"]
[275,"Zillmere State School",{"$f":"IF(ISERROR(SEARCH(Workplace_Name,Workplace_Lookup!B1370)),0,1)","v":1},{"$f":"IF(C1370=0,\"\",COUNTIF($B$2:C1370,1))","v":1369},"Zillmere State School"]